List of all errors present in the httpd source.

This is a work in progress!

Message

Source

Description

AH00001: unable to create or access scoreboard \"%s\" "(name-based shared memory failure)", fname

./server/scoreboard.c:186

AH00002: Fatal error: unable to create global pool "for use by the scoreboard"

./server/scoreboard.c:211

AH00003: Fatal error: Invalid Scoreboard path %s"

./server/scoreboard.c:222

AH00004: Unable to create or access scoreboard "(anonymous shared memory failure)"

./server/scoreboard.c:233

AH00005: Fatal error: shared scoreboard too small for child!"

./server/scoreboard.c:261

AH00006: core_filter: sendfile_nonblocking: "this should never happen"

./server/core_filters.c:843

AH00007: LOG_PREFIXuser '%s' set cookie: '%s'", r->user, rfc2109

./server/util_cookies.c:58

AH00008: LOG_PREFIXuser '%s' set cookie2: '%s'", r->user, rfc2965

./server/util_cookies.c:100

AH00009: LOG_PREFIXuser '%s' removed cookie: '%s'", r->user, rfc2109

./server/util_cookies.c:128

AH00010: LOG_PREFIXuser '%s' removed cookie2: '%s'", r->user, rfc2965

./server/util_cookies.c:156

AH00011: LOG_PREFIXclient submitted cookie '%s' more than once: %s", v.name, r->uri

./server/util_cookies.c:259

AH00012: %s: %s", ap_server_argv0, error

./server/main.c:483

AH00013: "Pre-configuration failed"

./server/main.c:635

AH00014: "Configuration check failed"

./server/main.c:653

AH00015: "Unable to open logs"

./server/main.c:692

AH00016: "Configuration Failed"

./server/main.c:698

AH00017: "Pre-configuration failed, exiting"

./server/main.c:735

AH00018: "Configuration check failed, exiting"

./server/main.c:754

AH00019: "Unable to open logs, exiting"

./server/main.c:761

AH00020: "Configuration Failed, exiting"

./server/main.c:767

AH00021: Invalid options were specified when creating the %s mutex"

./server/util_mutex.c:375

AH00022: Can't create mutex of unknown type %s", type

./server/util_mutex.c:382

AH00023: Couldn't create the %s mutex %s%s%s", type

./server/util_mutex.c:389

AH00024: Couldn't set permissions on the %s mutex; "check User and Group directives"

./server/util_mutex.c:399

AH00025: configuration error: couldn't %s: %s", phase, r->uri

./server/request.c:102

AH00026: found %%2f (encoded '/') in URI "(decoded='%s'), returning 404"

./server/request.c:137

AH00027: Buggy authn provider failed to set user for %s"

./server/request.c:238

AH00028: Buggy authn provider failed to set user for %s"

./server/request.c:273

AH00029: Module bug? Request filename is missing for URI %s"

./server/request.c:561

AH00030: Module bug? Request filename path %s is invalid or "or not absolute for uri %s"

./server/request.c:574

AH00031: access to %s failed; stat of '%s' failed."

./server/request.c:686

AH00032: Symbolic link not allowed "or link target not accessible: %s"

./server/request.c:695

AH00033: dir_walk error, path_info %s is not relative "to the filename path %s for uri %s"

./server/request.c:765

AH00034: dir_walk error, could not determine the root "path of filename %s%s for uri %s"

./server/request.c:832

AH00035: access to %s denied because search "permissions are missing on a component "of the path", r->uri

./server/request.c:1096

AH00036: access to %s failed", r->uri

./server/request.c:1107

AH00037: Symbolic link not allowed "or link target not accessible: %s"

./server/request.c:1129

AH00038: Forbidden: %s doesn't point to "a file or directory"

./server/request.c:1146

AH00039: Failed to evaluate <If > condition: %s"

./server/request.c:1682

AH00040: apr_xlate_open() failed"

./server/util_ebcdic.c:37

AH00041: apr_xlate_open() failed"

./server/util_ebcdic.c:44

AH00042: apr_MD5InitEBCDIC() failed"

./server/util_ebcdic.c:51

AH00043: apr_base64init_ebcdic() failed"

./server/util_ebcdic.c:58

AH00044: apr_SHA1InitEBCDIC() failed"

./server/util_ebcdic.c:65

AH00045: child process %" APR_PID_T_FMT still did not exit, "sending a SIGTERM"

./server/mpm_unix.c:140

AH00046: child process %" APR_PID_T_FMT still did not exit, "sending a SIGKILL"

./server/mpm_unix.c:150

AH00047: could not make child process %" APR_PID_T_FMT exit, "attempting to continue anyway"

./server/mpm_unix.c:165

AH00048: cannot send signal %d to pid %ld (non-child or "already dead)", sig, (long)pid

./server/mpm_unix.c:340

AH00049: refusing to send signal %d to pid %ld outside "process group", sig, (long)pid

./server/mpm_unix.c:360

AH00050: Child %" APR_PID_T_FMT returned a Fatal error... Apache is exiting!"

./server/mpm_unix.c:391

AH00051: child pid %ld exit signal %s (%d), "possible coredump in %s"

./server/mpm_unix.c:414

AH00052: child pid %ld exit signal %s (%d)"

./server/mpm_unix.c:422

AH00053: write pipe_of_death"

./server/mpm_unix.c:496

AH00054: get socket to connect to listener"

./server/mpm_unix.c:537

AH00055: set timeout on socket to connect to listener"

./server/mpm_unix.c:551

AH00056: connect to listener on %pI", lp->bind_addr

./server/mpm_unix.c:570

AH00057: sending signal to server"

./server/mpm_unix.c:639

AH00058: Error retrieving pid file %s", ap_pid_fname

./server/mpm_unix.c:658

AH00059: Remove it before continuing if it is corrupted."

./server/mpm_unix.c:660

AH00060: seg fault or similar nasty error detected "in the parent process"

./server/mpm_unix.c:851

AH00061: "sigaction(SIGSEGV)"

./server/mpm_unix.c:893

AH00062: "sigaction(SIGBUS)"

./server/mpm_unix.c:896

AH00063: "sigaction(SIGABORT)"

./server/mpm_unix.c:900

AH00064: "sigaction(SIGABRT)"

./server/mpm_unix.c:904

AH00065: "sigaction(SIGILL)"

./server/mpm_unix.c:908

AH00066: "sigaction(SIGFPE)"

./server/mpm_unix.c:912

AH00067: make_sock: for address %pI, apr_socket_opt_set: (SO_REUSEADDR)"

./server/listen.c:59

AH00068: make_sock: for address %pI, apr_socket_opt_set: (SO_KEEPALIVE)"

./server/listen.c:69

AH00069: make_sock: for address %pI, apr_socket_opt_set: "(IPV6_V6ONLY)"

./server/listen.c:80

AH00070: make_sock: failed to set SendBufferSize for "address %pI, using default"

./server/listen.c:112

AH00071: make_sock: failed to set ReceiveBufferSize for "address %pI, using default"

./server/listen.c:122

AH00072: make_sock: could not bind to address %pI"

./server/listen.c:135

AH00073: make_sock: unable to listen for connections "on address %pI"

./server/listen.c:143

AH00074: make_sock: for address %pI, apr_socket_opt_set: (SO_REUSEADDR)"

./server/listen.c:164

AH00075: Failed to enable the '%s' Accept Filter"

./server/listen.c:219

AH00076: Failed to enable APR_TCP_DEFER_ACCEPT"

./server/listen.c:226

AH00077: alloc_listener: failed to set up sockaddr for %s"

./server/listen.c:285

AH00078: alloc_listener: failed to get a socket for %s"

./server/listen.c:323

AH00079: unable to control socket non-blocking status"

./server/listen.c:501

AH00080: a content filter was added without a request: %s", frec->name

./server/util_filter.c:297

AH00081: a protocol filter was added without a request: %s", frec->name

./server/util_filter.c:307

AH00082: an unknown filter was not added: %s", name

./server/util_filter.c:404

AH00083: ap_pass_brigade returned %d", rv

./server/util_filter.c:556

AH00085: "Invalid -E error log file %s"

./server/log.c:251

AH00086: %s: could not open error log file %s."

./server/log.c:258

AH00087: unable to replace stderr with error log file"

./server/log.c:291

AH00088: %s", description

./server/log.c:300

AH00089: Couldn't start ErrorLog process '%s'."

./server/log.c:390

AH00090: %s: Invalid error log path %s."

./server/log.c:424

AH00091: %s: could not open error log file %s."

./server/log.c:432

AH00092: unable to replace stderr with error_log"

./server/log.c:483

AH00093: unable to replace stderr with /dev/null"

./server/log.c:513

AH00094: Command line: '%s'", result

./server/log.c:1388

AH00095: failed to remove PID file %s", fname

./server/log.c:1400

AH00096: removed PID file %s (pid=%" APR_PID_T_FMT ")"

./server/log.c:1404

AH00097: "Invalid PID file path %s, ignoring.", filename

./server/log.c:1427

AH00098: pid file %s overwritten -- Unclean "shutdown of previous Apache run?"

./server/log.c:1441

AH00099: could not create %s", fname

./server/log.c:1451

AH00100: %s: could not log pid to file %s"

./server/log.c:1453

AH00101: "Invalid PID file path %s, ignoring.", filename

./server/log.c:1480

AH00102: [%s] file %s, line %d, assertion \"%s\" failed"

./server/log.c:1515

AH00103: piped_log_spawn: unable to setup child process '%s': %s"

./server/log.c:1553

AH00104: unable to start piped log program '%s': %s"

./server/log.c:1581

AH00105: can't query MPM state; not restarting "piped log program '%s'"

./server/log.c:1606

AH00106: piped log program '%s' failed unexpectedly"

./server/log.c:1612

AH00107: piped_log_maintenance: unable to respawn '%s': %s"

./server/log.c:1619

AH00108: Couldn't start piped log process '%s'."

./server/log.c:1712

AH00109: ap_get_server_name: Invalid UCN Option somehow"

./server/core.c:982

AH00110: ap_get_server_port: Invalid UCN Option somehow"

./server/core.c:1045

AH00111: Config variable ${%s} is not defined"

./server/core.c:1227

AH00112: Warning: DocumentRoot [%s] does not exist"

./server/core.c:1425

AH00113: cannot use a full URL in a 401 ErrorDocument "directive --- ignoring!"

./server/core.c:1490

AH00114: Useless use of AllowOverride in line %d of %s."

./server/core.c:1592

AH00115: Useless use of AllowOverrideList in line %d of %s."

./server/core.c:1663

AH00116: Discarding unrecognized directive `%s' in AllowOverrideList."

./server/core.c:1683

AH00117: Ignoring deprecated use of DefaultType in line %d of %s."

./server/core.c:1795

AH00118: %s not supported on this platform", cmd->cmd->name

./server/core.c:3382

AH00119: Limiting internal redirects to very low numbers may "cause normal requests to fail."

./server/core.c:3440

AH00120: Limiting the subrequest depth to a very low level may" cause normal requests to fail."

./server/core.c:3454

AH00121: r->uri = %s", r->uri ? r->uri : "(unexpectedly NULL)"

./server/core.c:3469

AH00122: redirected from r->uri = %s"

./server/core.c:3475

AH00123: subrequested from r->uri = %s"

./server/core.c:3482

AH00124: Request exceeded the limit of %d internal "redirects due to probable configuration error. "Use 'LimitInternalRecursion' to increase the "limit if necessary. Use 'LogLevel debug' to get "a backtrace.", rlimit

./server/core.c:3510

AH00125: Request exceeded the limit of %d subrequest "nesting levels due to probable configuration "error. Use 'LimitInternalRecursion' to increase "the limit if necessary. Use 'LogLevel debug' to "get a backtrace.", slimit

./server/core.c:3530

AH00126: Invalid URI in request %s", r->the_request

./server/core.c:4091

AH00127: Cannot map %s to file", r->the_request

./server/core.c:4122

AH00128: File does not exist: %s", r->filename

./server/core.c:4222

AH00129: Attempt to serve directory: %s", r->filename

./server/core.c:4231

AH00130: File does not exist: %s"

./server/core.c:4240

AH00131: This resource does not accept the %s method."

./server/core.c:4260

AH00132: file permissions deny server access: %s", r->filename

./server/core.c:4273

AH00133: default_handler: ap_pass_brigade returned %i"

./server/core.c:4315

AH00134: Invalid method in request %s - possible attempt to establish SSL connection on non-SSL port", r->the_request

./server/core.c:4330

AH00135: Invalid method in request %s", r->the_request

./server/core.c:4333

AH00136: Server MUST relinquish startup privileges before "accepting connections. Please ensure mod_unixd "or other system security module is loaded."

./server/core.c:4428

AH00137: apr_socket_addr_get(APR_LOCAL)"

./server/core.c:4549

AH00138: apr_socket_addr_get(APR_REMOTE)"

./server/core.c:4558

AH00139: apr_socket_opt_set(APR_TCP_NODELAY)"

./server/core.c:4592

AH00140: apr_socket_timeout_set"

./server/core.c:4605

AH00141: Could not initialize random number generator"

./server/core.c:4687

AH00142: gprof: error creating directory %s", dir

./server/mpm/prefork/prefork.c:178

AH00143: "%s", msg

./server/mpm/prefork/prefork.c:238

AH00144: "%s", msg

./server/mpm/prefork/prefork.c:242

AH00145: "%s", msg

./server/mpm/prefork/prefork.c:256

AH00146: "%s", msg

./server/mpm/prefork/prefork.c:263

AH00147: "sigaction(SIGTERM)"

./server/mpm/prefork/prefork.c:405

AH00148: sigaction(" AP_SIG_GRACEFUL_STOP_STRING ")"

./server/mpm/prefork/prefork.c:408

AH00149: "sigaction(SIGINT)"

./server/mpm/prefork/prefork.c:413

AH00150: "sigaction(SIGXCPU)"

./server/mpm/prefork/prefork.c:418

AH00151: "sigaction(SIGXFSZ)"

./server/mpm/prefork/prefork.c:426

AH00152: "sigaction(SIGPIPE)"

./server/mpm/prefork/prefork.c:431

AH00153: "sigaction(SIGHUP)"

./server/mpm/prefork/prefork.c:441

AH00154: "sigaction(" AP_SIG_GRACEFUL_STRING ")"

./server/mpm/prefork/prefork.c:443

AH00155: Couldn't initialize cross-process lock in child "(%s) (%s)"

./server/mpm/prefork/prefork.c:531

AH00156: Couldn't create pollset in child; check system or user limits"

./server/mpm/prefork/prefork.c:552

AH00157: Couldn't add listener to pollset; check system or user limits"

./server/mpm/prefork/prefork.c:567

AH00158: "apr_pollset_poll: (listen)"

./server/mpm/prefork/prefork.c:642

AH00159: "fork: Unable to fork new process"

./server/mpm/prefork/prefork.c:753

AH00160: "processor unbind failed"

./server/mpm/prefork/prefork.c:779

AH00161: server reached MaxRequestWorkers setting, consider" raising the MaxRequestWorkers setting"

./server/mpm/prefork/prefork.c:878

AH00162: server seems busy, (you may need "to increase StartServers, or Min/MaxSpareServers), "spawning %d children, there are %d idle, and "%d total children", retained->idle_spawn_rate

./server/mpm/prefork/prefork.c:887

AH00163: %s configured -- resuming normal operations"

./server/mpm/prefork/prefork.c:979

AH00164: Server built: %s", ap_get_server_built()

./server/mpm/prefork/prefork.c:982

AH00165: Accept mutex: %s (default: %s)"

./server/mpm/prefork/prefork.c:985

AH00166: Ignoring fatal error in child of previous "generation (pid %ld)."

./server/mpm/prefork/prefork.c:1021

AH00167: long lost child came home! (pid %ld)", (long)pid.pid

./server/mpm/prefork/prefork.c:1059

AH00168: "killpg SIGTERM"

./server/mpm/prefork/prefork.c:1094

AH00169: caught SIGTERM, shutting down"

./server/mpm/prefork/prefork.c:1101

AH00170: caught " AP_SIG_GRACEFUL_STOP_STRING ", shutting down gracefully"

./server/mpm/prefork/prefork.c:1135

AH00171: Graceful restart requested, doing restart"

./server/mpm/prefork/prefork.c:1188

AH00172: "killpg SIGHUP"

./server/mpm/prefork/prefork.c:1216

AH00173: SIGHUP received. Attempting to restart"

./server/mpm/prefork/prefork.c:1220

AH00174: apr_proc_detach failed"

./server/mpm/prefork/prefork.c:1298

AH00175: WARNING: ServerLimit of %d exceeds compile-time "limit of", server_limit

./server/mpm/prefork/prefork.c:1330

AH00176: ServerLimit of %d exceeds compile-time limit "of %d, decreasing to match"

./server/mpm/prefork/prefork.c:1337

AH00177: WARNING: ServerLimit of %d not allowed, "increasing to 1.", server_limit

./server/mpm/prefork/prefork.c:1346

AH00178: ServerLimit of %d not allowed, increasing to 1"

./server/mpm/prefork/prefork.c:1350

AH00179: changing ServerLimit to %d from original value of %d "not allowed during restart"

./server/mpm/prefork/prefork.c:1365

AH00180: WARNING: MaxRequestWorkers of %d exceeds ServerLimit "value of", ap_daemons_limit

./server/mpm/prefork/prefork.c:1374

AH00181: MaxRequestWorkers of %d exceeds ServerLimit value "of %d, decreasing to match"

./server/mpm/prefork/prefork.c:1384

AH00182: WARNING: MaxRequestWorkers of %d not allowed, "increasing to 1.", ap_daemons_limit

./server/mpm/prefork/prefork.c:1393

AH00183: MaxRequestWorkers of %d not allowed, increasing to 1"

./server/mpm/prefork/prefork.c:1397

AH00184: WARNING: StartServers of %d not allowed, "increasing to 1.", ap_daemons_to_start

./server/mpm/prefork/prefork.c:1407

AH00185: StartServers of %d not allowed, increasing to 1"

./server/mpm/prefork/prefork.c:1411

AH00186: WARNING: MinSpareServers of %d not allowed, "increasing to 1", ap_daemons_min_free

./server/mpm/prefork/prefork.c:1420

AH00187: MinSpareServers of %d not allowed, increasing to 1"

./server/mpm/prefork/prefork.c:1428

AH00188: MaxClients is deprecated, use MaxRequestWorkers "instead."

./server/mpm/prefork/prefork.c:1499

AH00189: unable to create shutdown semaphore, exiting"

./server/mpm/mpmt_os2/mpmt_os2_child.c:120

AH00190: scoreboard not readable in child, exiting"

./server/mpm/mpmt_os2/mpmt_os2_child.c:130

AH00191: accept mutex couldn't be accessed in child, exiting"

./server/mpm/mpmt_os2/mpmt_os2_child.c:142

AH00192: child pid not found in scoreboard, exiting"

./server/mpm/mpmt_os2/mpmt_os2_child.c:151

AH00193: unable to create work queue, exiting"

./server/mpm/mpmt_os2/mpmt_os2_child.c:165

AH00194: apr_socket_accept"

./server/mpm/mpmt_os2/mpmt_os2_child.c:238

AH00195: caught exception in worker thread, initiating child shutdown pid=%d", getpid()

./server/mpm/mpmt_os2/mpmt_os2_child.c:322

AH00196: unable to open work queue, exiting"

./server/mpm/mpmt_os2/mpmt_os2_child.c:373

AH00197: unable to open work queue in maintenance thread"

./server/mpm/mpmt_os2/mpmt_os2_child.c:427

AH00198: "sigaction(SIGTERM)"

./server/mpm/mpmt_os2/mpmt_os2_child.c:482

AH00199: "sigaction(SIGHUP)"

./server/mpm/mpmt_os2/mpmt_os2_child.c:487

AH00200: no listening sockets available, shutting down"

./server/mpm/mpmt_os2/mpmt_os2.c:164

AH00201: caught SIGTERM, shutting down"

./server/mpm/mpmt_os2/mpmt_os2.c:177

AH00202: no listening sockets available, shutting down"

./server/mpm/mpmt_os2/mpmt_os2.c:204

AH00203: failure allocating shared memory, shutting down"

./server/mpm/mpmt_os2/mpmt_os2.c:220

AH00204: failure creating accept mutex, shutting down"

./server/mpm/mpmt_os2/mpmt_os2.c:237

AH00205: unable to allocate shared memory for scoreboard , exiting"

./server/mpm/mpmt_os2/mpmt_os2.c:252

AH00206: %s configured -- resuming normal operations"

./server/mpm/mpmt_os2/mpmt_os2.c:261

AH00207: Server built: %s", ap_get_server_built()

./server/mpm/mpmt_os2/mpmt_os2.c:264

AH00208: error spawning child, slot %d", slot

./server/mpm/mpmt_os2/mpmt_os2.c:342

AH00209: "sigaction(SIGTERM)"

./server/mpm/mpmt_os2/mpmt_os2.c:385

AH00210: "sigaction(SIGINT)"

./server/mpm/mpmt_os2/mpmt_os2.c:388

AH00211: "sigaction(SIGHUP)"

./server/mpm/mpmt_os2/mpmt_os2.c:393

AH00212: "sigaction(SIGUSR1)"

./server/mpm/mpmt_os2/mpmt_os2.c:395

AH00213: WARNING: StartServers of %d not allowed, "increasing to 1.", ap_daemons_to_start

./server/mpm/mpmt_os2/mpmt_os2.c:495

AH00214: StartServers of %d not allowed, increasing to 1"

./server/mpm/mpmt_os2/mpmt_os2.c:499

AH00215: WARNING: MinSpareThreads of %d not allowed, "increasing to 1", ap_min_spare_threads

./server/mpm/mpmt_os2/mpmt_os2.c:508

AH00216: MinSpareThreads of %d not allowed, increasing to 1"

./server/mpm/mpmt_os2/mpmt_os2.c:516

AH00217: select() failed on listen socket"

./server/mpm/netware/mpm_netware.c:408

AH00218: apr_socket_accept: giving up."

./server/mpm/netware/mpm_netware.c:507

AH00219: apr_socket_accept: (client socket)"

./server/mpm/netware/mpm_netware.c:514

AH00220: server reached MaxRequestWorkers setting, consider" raising the MaxRequestWorkers setting"

./server/mpm/netware/mpm_netware.c:683

AH00221: server seems busy, (you may need "to increase StartServers, or Min/MaxSpareServers), "spawning %d children, there are %d idle, and "%d total children", idle_spawn_rate

./server/mpm/netware/mpm_netware.c:692

AH00222: no listening sockets available, shutting down"

./server/mpm/netware/mpm_netware.c:833

AH00223: no listening sockets available, shutting down"

./server/mpm/netware/mpm_netware.c:873

AH00224: %s configured -- resuming normal operations"

./server/mpm/netware/mpm_netware.c:913

AH00225: Server built: %s", ap_get_server_built()

./server/mpm/netware/mpm_netware.c:916

AH00226: caught SIGTERM, shutting down"

./server/mpm/netware/mpm_netware.c:941

AH00227: Graceful restart requested, doing restart"

./server/mpm/netware/mpm_netware.c:961

AH00228: WARNING: MaxThreads of %d exceeds compile-time "limit of", ap_threads_limit

./server/mpm/netware/mpm_netware.c:1021

AH00229: MaxThreads of %d exceeds compile-time limit "of %d, decreasing to match"

./server/mpm/netware/mpm_netware.c:1033

AH00230: "WARNING: MaxThreads of %d not allowed, "increasing to 1.", ap_threads_limit

./server/mpm/netware/mpm_netware.c:1043

AH00231: WARNING: StartThreads of %d not allowed, "increasing to 1.", ap_threads_to_start

./server/mpm/netware/mpm_netware.c:1058

AH00232: StartThreads of %d not allowed, increasing to 1"

./server/mpm/netware/mpm_netware.c:1062

AH00233: WARNING: MinSpareThreads of %d not allowed, "increasing to 1", ap_threads_min_free

./server/mpm/netware/mpm_netware.c:1071

AH00234: MinSpareThreads of %d not allowed, increasing to 1"

./server/mpm/netware/mpm_netware.c:1079

AH00235: simple_setup_workers: apr_thread_pool_create with %d threads failed"

./server/mpm/simple/simple_run.c:62

AH00236: simple_setup_workers: apr_socket_opt_set(APR_SO_NONBLOCK = 1) failed on %pI"

./server/mpm/simple/simple_run.c:92

AH00237: simple_setup_workers: apr_pollcb_add failed on %pI"

./server/mpm/simple/simple_run.c:100

AH00238: simple_single_child_hack: simple_setup_listeners failed"

./server/mpm/simple/simple_run.c:239

AH00239: simple_setup_privs: ap_run_drop_privileges failed"

./server/mpm/simple/simple_run.c:249

AH00240: simple_setup_pollcb: apr_pollcb_create failed for all possible backends!"

./server/mpm/simple/simple_run.c:272

AH00241: simple_child_loop: simple_setup_workers failed"

./server/mpm/simple/simple_run.c:295

AH00242: simple_child_loop: simple_setup_sockets failed"

./server/mpm/simple/simple_run.c:302

AH00243: simple_main_loop: simple_setup_workers failed"

./server/mpm/simple/simple_run.c:329

AH00244: simple_main_loop: simple_setup_timers failed"

./server/mpm/simple/simple_run.c:336

AH00245: simple_spawn_child: Unable to fork new process"

./server/mpm/simple/simple_children.c:76

AH00246: simple_core_init_once: apr_thread_mutex_create failed."

./server/mpm/simple/simple_core.c:67

AH00247: io timeout hit (?)"

./server/mpm/simple/simple_io.c:43

AH00248: simple_io_process: apr_pollcb_remove failure"

./server/mpm/simple/simple_io.c:72

AH00249: network write failure in core output filter"

./server/mpm/simple/simple_io.c:102

AH00250: apr_pollcb_add: failed in write completion"

./server/mpm/simple/simple_io.c:126

AH00251: process_socket: apr_pollcb_add failure in read request line"

./server/mpm/simple/simple_io.c:163

AH00252: simple_io_invoke: simple_io_process failed (?)"

./server/mpm/simple/simple_io.c:188

AH00253: simple_io_setup_conn: connection aborted"

./server/mpm/simple/simple_io.c:230

AH00254: simple_io_setup_conn: simple_io_process failed (?)"

./server/mpm/simple/simple_io.c:240

AH00255: simple_io_accept: apr_socket_accept failed"

./server/mpm/simple/simple_io.c:268

AH00256: simple_open_logs: no listening sockets available, shutting down"

./server/mpm/simple/simple_api.c:116

AH00257: simple_core_init_once: Fatal Error Encountered"

./server/mpm/simple/simple_api.c:135

AH00258: simple_pre_config: apr_proc_detach(%s) failed"

./server/mpm/simple/simple_api.c:164

AH00259: simple_check_config: SimpleProcCount must be at most %d"

./server/mpm/simple/simple_api.c:181

AH00260: simple_check_config: SimpleProcCount must be at least %d"

./server/mpm/simple/simple_api.c:188

AH00261: simple_check_config: SimpleThreadCount must be at most %d"

./server/mpm/simple/simple_api.c:195

AH00262: simple_check_config: SimpleThreadCount must be at least %d"

./server/mpm/simple/simple_api.c:202

AH00263: pid %" APR_PID_T_FMT " taking over scoreboard slot from "%" APR_PID_T_FMT "%s"

./server/mpm/worker/worker.c:399

AH00264: sigaction(SIGTERM)"

./server/mpm/worker/worker.c:525

AH00265: sigaction(" AP_SIG_GRACEFUL_STOP_STRING ")"

./server/mpm/worker/worker.c:529

AH00266: sigaction(SIGINT)"

./server/mpm/worker/worker.c:534

AH00267: sigaction(SIGXCPU)"

./server/mpm/worker/worker.c:540

AH00268: sigaction(SIGXFSZ)"

./server/mpm/worker/worker.c:549

AH00269: sigaction(SIGPIPE)"

./server/mpm/worker/worker.c:555

AH00270: sigaction(SIGHUP)"

./server/mpm/worker/worker.c:565

AH00271: sigaction(" AP_SIG_GRACEFUL_STRING ")"

./server/mpm/worker/worker.c:568

AH00272: apr_proc_mutex_%s failed "before this child process served any requests."

./server/mpm/worker/worker.c:668

AH00273: apr_proc_mutex_%s failed. Attempting to "shutdown process gracefully.", func

./server/mpm/worker/worker.c:674

AH00274: apr_proc_mutex_unlock failed. Attempting to "shutdown process gracefully."

./server/mpm/worker/worker.c:874

AH00275: apr_thread_create: unable to create listener thread"

./server/mpm/worker/worker.c:1016

AH00276: the listener thread didn't exit"

./server/mpm/worker/worker.c:1162

AH00277: apr_thread_join: unable to join listener thread"

./server/mpm/worker/worker.c:1168

AH00278: apr_thread_join: unable to join worker "thread %d"

./server/mpm/worker/worker.c:1185

AH00279: apr_thread_join: unable to join the start "thread"

./server/mpm/worker/worker.c:1204

AH00280: Couldn't initialize cross-process lock in child"

./server/mpm/worker/worker.c:1232

AH00281: Couldn't initialize signal thread"

./server/mpm/worker/worker.c:1251

AH00282: apr_thread_create: unable to create worker thread"

./server/mpm/worker/worker.c:1289

AH00283: fork: Unable to fork new process"

./server/mpm/worker/worker.c:1385

AH00284: processor unbind failed"

./server/mpm/worker/worker.c:1411

AH00285: No active workers found..." Apache is exiting!"

./server/mpm/worker/worker.c:1555

AH00286: server reached MaxRequestWorkers "setting, consider raising the "MaxRequestWorkers setting"

./server/mpm/worker/worker.c:1580

AH00287: server is within MinSpareThreads of "MaxRequestWorkers, consider raising the "MaxRequestWorkers setting"

./server/mpm/worker/worker.c:1588

AH00288: scoreboard is full, not at MaxRequestWorkers"

./server/mpm/worker/worker.c:1598

AH00289: server seems busy, (you may need "to increase StartServers, ThreadsPerChild "or Min/MaxSpareThreads), "spawning %d children, there are around %d idle "threads, and %d total children", free_length

./server/mpm/worker/worker.c:1609

AH00290: Ignoring fatal error in child of previous "generation (pid %ld)."

./server/mpm/worker/worker.c:1665

AH00291: long lost child came home! (pid %ld)"

./server/mpm/worker/worker.c:1714

AH00292: %s configured -- resuming normal operations"

./server/mpm/worker/worker.c:1798

AH00293: Server built: %s", ap_get_server_built()

./server/mpm/worker/worker.c:1801

AH00294: Accept mutex: %s (default: %s)"

./server/mpm/worker/worker.c:1804

AH00295: "caught SIGTERM, shutting down"

./server/mpm/worker/worker.c:1825

AH00296: caught " AP_SIG_GRACEFUL_STOP_STRING, shutting down gracefully"

./server/mpm/worker/worker.c:1844

AH00297:

./server/mpm/worker/worker.c:1900

AH00298: SIGHUP received. Attempting to restart"

./server/mpm/worker/worker.c:1920

AH00299: apr_proc_detach failed"

./server/mpm/worker/worker.c:2000

AH00300: WARNING: ServerLimit of %d exceeds compile-time "limit of", server_limit

./server/mpm/worker/worker.c:2035

AH00301: ServerLimit of %d exceeds compile-time limit "of %d, decreasing to match"

./server/mpm/worker/worker.c:2042

AH00302: WARNING: ServerLimit of %d not allowed, "increasing to 1.", server_limit

./server/mpm/worker/worker.c:2051

AH00303: ServerLimit of %d not allowed, increasing to 1"

./server/mpm/worker/worker.c:2055

AH00304: changing ServerLimit to %d from original value of %d "not allowed during restart"

./server/mpm/worker/worker.c:2070

AH00305: WARNING: ThreadLimit of %d exceeds compile-time "limit of", thread_limit

./server/mpm/worker/worker.c:2079

AH00306: ThreadLimit of %d exceeds compile-time limit "of %d, decreasing to match"

./server/mpm/worker/worker.c:2086

AH00307: WARNING: ThreadLimit of %d not allowed, "increasing to 1.", thread_limit

./server/mpm/worker/worker.c:2095

AH00308: ThreadLimit of %d not allowed, increasing to 1"

./server/mpm/worker/worker.c:2099

AH00309: changing ThreadLimit to %d from original value of %d "not allowed during restart"

./server/mpm/worker/worker.c:2114

AH00310: WARNING: ThreadsPerChild of %d exceeds ThreadLimit "of", threads_per_child

./server/mpm/worker/worker.c:2123

AH00311: ThreadsPerChild of %d exceeds ThreadLimit "of %d, decreasing to match"

./server/mpm/worker/worker.c:2133

AH00312: WARNING: ThreadsPerChild of %d not allowed, "increasing to 1.", threads_per_child

./server/mpm/worker/worker.c:2142

AH00313: ThreadsPerChild of %d not allowed, increasing to 1"

./server/mpm/worker/worker.c:2146

AH00314: WARNING: MaxRequestWorkers of %d is less than "ThreadsPerChild of", max_workers

./server/mpm/worker/worker.c:2155

AH00315: MaxRequestWorkers of %d is less than ThreadsPerChild "of %d, increasing to match"

./server/mpm/worker/worker.c:2165

AH00316: WARNING: MaxRequestWorkers of %d is not an integer "multiple of", max_workers

./server/mpm/worker/worker.c:2179

AH00317: MaxRequestWorkers of %d is not an integer multiple of "ThreadsPerChild of %d, decreasing to nearest "multiple %d", max_workers, threads_per_child

./server/mpm/worker/worker.c:2190

AH00318: WARNING: MaxRequestWorkers of %d would require %d "servers and ", max_workers, ap_daemons_limit

./server/mpm/worker/worker.c:2201

AH00319: MaxRequestWorkers of %d would require %d servers and "exceed ServerLimit of %d, decreasing to %d"

./server/mpm/worker/worker.c:2211

AH00320: WARNING: StartServers of %d not allowed, "increasing to 1.", ap_daemons_to_start

./server/mpm/worker/worker.c:2223

AH00321: StartServers of %d not allowed, increasing to 1"

./server/mpm/worker/worker.c:2227

AH00322: WARNING: MinSpareThreads of %d not allowed, "increasing to 1", min_spare_threads

./server/mpm/worker/worker.c:2236

AH00323: MinSpareThreads of %d not allowed, increasing to 1"

./server/mpm/worker/worker.c:2244

AH00324: MaxClients is deprecated, use MaxRequestWorkers "instead."

./server/mpm/worker/worker.c:2322

AH00325: write pipe_of_death"

./server/mpm/worker/pod.c:93

AH00326: Server ran out of threads to serve "requests. Consider raising the "ThreadsPerChild setting"

./server/mpm/winnt/child.c:169

AH00327: mpm_get_completion_context: Failed to get a "free context within 1 second"

./server/mpm/winnt/child.c:187

AH00328: mpm_get_completion_context: "WaitForSingleObject failed to get free context"

./server/mpm/winnt/child.c:195

AH00329: mpm_get_completion_context: "CreateEvent failed."

./server/mpm/winnt/child.c:219

AH00330: mpm_get_completion_context: Failed "to create the transaction pool."

./server/mpm/winnt/child.c:233

AH00331: winnt_accept: unrecognized AcceptFilter '%s', "only 'data', 'connect' or 'none' are valid. "Using 'none' instead", accf_name

./server/mpm/winnt/child.c:308

AH00332: winnt_accept: getsockname error on listening socket, "is IPv6 available?"

./server/mpm/winnt/child.c:319

AH00333: WSAEventSelect() failed."

./server/mpm/winnt/child.c:347

AH00334: Child: Accept thread listening on %s:%d using AcceptFilter %s"

./server/mpm/winnt/child.c:354

AH00335: winnt_accept: Too many failures grabbing a "connection ctx. Aborting."

./server/mpm/winnt/child.c:369

AH00336: winnt_accept: Failed to allocate an accept socket. "Temporary resource constraint? Try again."

./server/mpm/winnt/child.c:405

AH00337: Child: Encountered too many AcceptEx "faults accepting client connections. "Possible causes: dynamic address renewal, "or incompatible VPN or firewall software. "

./server/mpm/winnt/child.c:457

AH00338: winnt_mpm: falling back to "'AcceptFilter none'."

./server/mpm/winnt/child.c:462

AH00339: Child: Encountered too many AcceptEx "faults accepting client connections."

./server/mpm/winnt/child.c:478

AH00340: winnt_mpm: falling back to "'AcceptFilter none'."

./server/mpm/winnt/child.c:481

AH00341: winnt_accept: Asynchronous AcceptEx failed."

./server/mpm/winnt/child.c:504

AH00342: setsockopt(SO_UPDATE_ACCEPT_CONTEXT) failed."

./server/mpm/winnt/child.c:536

AH00343: accept() failed, retrying."

./server/mpm/winnt/child.c:604

AH00344: accept() failed."

./server/mpm/winnt/child.c:611

AH00345: Child: Encountered too many accept() "resource faults, aborting."

./server/mpm/winnt/child.c:620

AH00346: getsockname failed"

./server/mpm/winnt/child.c:641

AH00347: getpeername failed"

./server/mpm/winnt/child.c:647

AH00348: Child: Accept thread exiting."

./server/mpm/winnt/child.c:686

AH00349: Child: GetQueuedComplationStatus returned %d"

./server/mpm/winnt/child.c:715

AH00350: Child: Failed to create a max_requests event."

./server/mpm/winnt/child.c:935

AH00351: Child: Failed to acquire the start_mutex. "Process will exit."

./server/mpm/winnt/child.c:949

AH00352: Child: Acquired the start mutex."

./server/mpm/winnt/child.c:954

AH00353: Child: Failed to create a qwait event."

./server/mpm/winnt/child.c:967

AH00354: Child: Starting %d worker threads.", ap_threads_per_child

./server/mpm/winnt/child.c:975

AH00355: Child: CreateThread failed. Unable to "create all worker threads. Created %d of the %d "threads requested with the ThreadsPerChild "configuration directive."

./server/mpm/winnt/child.c:995

AH00356: Child: WAIT_FAILED -- shutting down server"

./server/mpm/winnt/child.c:1071

AH00357: Child: Exit event signaled. Child process is "ending."

./server/mpm/winnt/child.c:1077

AH00358: Child: Process exiting because it reached "MaxConnectionsPerChild. Signaling the parent to "restart a new child process."

./server/mpm/winnt/child.c:1086

AH00359: Child: Released the start mutex"

./server/mpm/winnt/child.c:1127

AH00360: Child: Failure releasing the start mutex"

./server/mpm/winnt/child.c:1131

AH00361: Child: %d threads blocked on the completion port"

./server/mpm/winnt/child.c:1139

AH00362: Child: Waiting %d more seconds "for %d worker threads to finish."

./server/mpm/winnt/child.c:1180

AH00363: Child: Terminating %d threads that failed to exit."

./server/mpm/winnt/child.c:1224

AH00364: Child: All worker threads have exited."

./server/mpm/winnt/child.c:1238

AH00365: "Failure registering service handler"

./server/mpm/winnt/service.c:317

AH00366: Error starting service control dispatcher"

./server/mpm/winnt/service.c:372

AH00367: No ConfigArgs registered for %s, perhaps "this service is not installed?"

./server/mpm/winnt/service.c:436

AH00368: GetModuleFileName failed"

./server/mpm/winnt/service.c:574

AH00369: Failed to open the WinNT service manager, perhaps "you forgot to log in as Adminstrator?"

./server/mpm/winnt/service.c:583

AH00370: Failed to create WinNT Service Profile"

./server/mpm/winnt/service.c:642

AH00371: %s: Failed to store the ConfigArgs in the registry."

./server/mpm/winnt/service.c:664

AH00372: Failed to open the WinNT service manager."

./server/mpm/winnt/service.c:686

AH00373: %s: OpenService failed", mpm_display_name

./server/mpm/winnt/service.c:696

AH00374: %s: Failed to delete the service.", mpm_display_name

./server/mpm/winnt/service.c:714

AH00375: Failed to open the WinNT service manager"

./server/mpm/winnt/service.c:763

AH00376: %s: Failed to open the service.", mpm_display_name

./server/mpm/winnt/service.c:773

AH00377: Service %s is already started!", mpm_display_name

./server/mpm/winnt/service.c:781

AH00378: %s: Failed to start the service process."

./server/mpm/winnt/service.c:808

AH00379: Failed to open the NT Service Manager"

./server/mpm/winnt/service.c:828

AH00380: Failed to open the %s Service", mpm_display_name

./server/mpm/winnt/service.c:841

AH00381: Query of Service %s failed", mpm_display_name

./server/mpm/winnt/service.c:848

AH00382: OpenEvent on %s event", signal_name

./server/mpm/winnt/mpm_winnt.c:249

AH00383: SetEvent on %s event", signal_name

./server/mpm/winnt/mpm_winnt.c:255

AH00384: Child: Unable to retrieve the ready event from the parent"

./server/mpm/winnt/mpm_winnt.c:289

AH00385: Child: Unable to retrieve the exit event from the parent"

./server/mpm/winnt/mpm_winnt.c:300

AH00386: Child: Unable to retrieve the start_mutex from the parent"

./server/mpm/winnt/mpm_winnt.c:308

AH00387: Child: Unable to access the start_mutex from the parent"

./server/mpm/winnt/mpm_winnt.c:315

AH00388: Child: Unable to retrieve the scoreboard from the parent"

./server/mpm/winnt/mpm_winnt.c:323

AH00389: Child: Unable to access the scoreboard from the parent"

./server/mpm/winnt/mpm_winnt.c:330

AH00390: Child: Unable to reopen the scoreboard from the parent"

./server/mpm/winnt/mpm_winnt.c:337

AH00391: Child: Retrieved our scoreboard from the parent."

./server/mpm/winnt/mpm_winnt.c:346

AH00392: Parent: Unable to duplicate the ready event handle for the child"

./server/mpm/winnt/mpm_winnt.c:368

AH00393: Parent: Unable to send the exit event handle to the child"

./server/mpm/winnt/mpm_winnt.c:374

AH00394: Parent: Unable to duplicate the exit event handle for the child"

./server/mpm/winnt/mpm_winnt.c:380

AH00395: Parent: Unable to send the exit event handle to the child"

./server/mpm/winnt/mpm_winnt.c:386

AH00396: Parent: Unable to retrieve the start mutex for the child"

./server/mpm/winnt/mpm_winnt.c:391

AH00397: Parent: Unable to duplicate the start mutex to the child"

./server/mpm/winnt/mpm_winnt.c:397

AH00398: Parent: Unable to send the start mutex to the child"

./server/mpm/winnt/mpm_winnt.c:403

AH00399: Parent: Unable to retrieve the scoreboard handle for the child"

./server/mpm/winnt/mpm_winnt.c:408

AH00400: Parent: Unable to duplicate the scoreboard handle to the child"

./server/mpm/winnt/mpm_winnt.c:414

AH00401: Parent: Unable to send the scoreboard handle to the child"

./server/mpm/winnt/mpm_winnt.c:420

AH00402: Parent: Sent the scoreboard to the child"

./server/mpm/winnt/mpm_winnt.c:425

AH00403: Child: Waiting for data for listening socket %pI"

./server/mpm/winnt/mpm_winnt.c:461

AH00404: Child: Unable to read socket data from parent"

./server/mpm/winnt/mpm_winnt.c:466

AH00405: Child: WSASocket failed to open the inherited socket"

./server/mpm/winnt/mpm_winnt.c:474

AH00406: Child: SetHandleInformation failed"

./server/mpm/winnt/mpm_winnt.c:480

AH00407: Child: retrieved %d listeners from parent", lcnt

./server/mpm/winnt/mpm_winnt.c:486

AH00408: Parent: Duplicating socket %d (%pI) and sending it to child process %lu"

./server/mpm/winnt/mpm_winnt.c:508

AH00409: Parent: WSADuplicateSocket failed for socket %d. Check the FAQ.", nsd

./server/mpm/winnt/mpm_winnt.c:513

AH00410: Parent: Unable to write duplicated socket %d to the child.", nsd

./server/mpm/winnt/mpm_winnt.c:521

AH00411: Parent: Sent %d listeners to child %lu", lcnt, dwProcessId

./server/mpm/winnt/mpm_winnt.c:527

AH00412: Parent: Failed to get the current path"

./server/mpm/winnt/mpm_winnt.c:567

AH00413: Parent: Failed to get full path of %s"

./server/mpm/winnt/mpm_winnt.c:577

AH00414: Parent: Unable to create child stdin pipe."

./server/mpm/winnt/mpm_winnt.c:598

AH00415: Parent: Could not create ready event for child process"

./server/mpm/winnt/mpm_winnt.c:607

AH00416: Parent: Could not create exit event for child process"

./server/mpm/winnt/mpm_winnt.c:616

AH00417: Parent: Failed to create the child process."

./server/mpm/winnt/mpm_winnt.c:636

AH00418: Parent: Created child process %d", new_child.pid

./server/mpm/winnt/mpm_winnt.c:645

AH00419: master_main: create child process failed. Exiting."

./server/mpm/winnt/mpm_winnt.c:770

AH00420: master_main: WaitForMultipleObjects WAIT_FAILED -- doing server shutdown"

./server/mpm/winnt/mpm_winnt.c:794

AH00421: master_main: WaitForMultipleObjects with INFINITE wait exited with WAIT_TIMEOUT"

./server/mpm/winnt/mpm_winnt.c:800

AH00422: Parent: Received shutdown signal -- Shutting down the server."

./server/mpm/winnt/mpm_winnt.c:807

AH00423: ResetEvent(shutdown_event)"

./server/mpm/winnt/mpm_winnt.c:810

AH00424: Parent: Received restart signal -- Restarting the server."

./server/mpm/winnt/mpm_winnt.c:819

AH00425: Parent: ResetEvent(restart_event) failed."

./server/mpm/winnt/mpm_winnt.c:822

AH00426: Parent: SetEvent for child process %pp failed."

./server/mpm/winnt/mpm_winnt.c:826

AH00427: Parent: child process exited with status %lu -- Aborting.", exitcode

./server/mpm/winnt/mpm_winnt.c:846

AH00428: Parent: child process exited with status %lu -- Restarting.", exitcode

./server/mpm/winnt/mpm_winnt.c:853

AH00429: Parent: SetEvent for child process %pp failed"

./server/mpm/winnt/mpm_winnt.c:888

AH00430: Parent: Child process exited successfully."

./server/mpm/winnt/mpm_winnt.c:895

AH00431: Parent: Forcing termination of child process %pp"

./server/mpm/winnt/mpm_winnt.c:901

AH00432: Failed to get the full path of %s", process->argv[0]

./server/mpm/winnt/mpm_winnt.c:1111

AH00433: %s: Service is already installed.", service_name

./server/mpm/winnt/mpm_winnt.c:1258

AH00434: Using ConfigArgs of the installed service "\"%s\".", service_name

./server/mpm/winnt/mpm_winnt.c:1284

AH00435: No installed ConfigArgs for the service "\"%s\", using Apache defaults.", service_name

./server/mpm/winnt/mpm_winnt.c:1289

AH00436: No installed service named \"%s\".", service_name

./server/mpm/winnt/mpm_winnt.c:1296

AH00437: No installed service named \"%s\".", service_name

./server/mpm/winnt/mpm_winnt.c:1303

AH00438: %s: Unable to start the service manager."

./server/mpm/winnt/mpm_winnt.c:1370

AH00439: WARNING: ThreadLimit of %d exceeds compile-time "limit of", thread_limit

./server/mpm/winnt/mpm_winnt.c:1418

AH00440: ThreadLimit of %d exceeds compile-time limit "of %d, decreasing to match"

./server/mpm/winnt/mpm_winnt.c:1425

AH00441: WARNING: ThreadLimit of %d not allowed, "increasing to 1.", thread_limit

./server/mpm/winnt/mpm_winnt.c:1434

AH00442: ThreadLimit of %d not allowed, increasing to 1"

./server/mpm/winnt/mpm_winnt.c:1438

AH00443: changing ThreadLimit to %d from original value "of %d not allowed during restart"

./server/mpm/winnt/mpm_winnt.c:1454

AH00444: WARNING: ThreadsPerChild of %d exceeds ThreadLimit "of", ap_threads_per_child

./server/mpm/winnt/mpm_winnt.c:1464

AH00445: ThreadsPerChild of %d exceeds ThreadLimit "of %d, decreasing to match"

./server/mpm/winnt/mpm_winnt.c:1474

AH00446: WARNING: ThreadsPerChild of %d not allowed, "increasing to 1.", ap_threads_per_child

./server/mpm/winnt/mpm_winnt.c:1483

AH00447: ThreadsPerChild of %d not allowed, increasing to 1"

./server/mpm/winnt/mpm_winnt.c:1487

AH00448: Parent: Cannot create shutdown event %s", signal_shutdown_name

./server/mpm/winnt/mpm_winnt.c:1574

AH00449: Parent: Cannot create restart event %s", signal_restart_name

./server/mpm/winnt/mpm_winnt.c:1586

AH00450: %s: Unable to create the start_mutex."

./server/mpm/winnt/mpm_winnt.c:1601

AH00451: "no listening sockets available, shutting down"

./server/mpm/winnt/mpm_winnt.c:1644

AH00452: %s child: Unable to init the start_mutex."

./server/mpm/winnt/mpm_winnt.c:1676

AH00453: Child process is running"

./server/mpm/winnt/mpm_winnt.c:1708

AH00454: Child process is exiting"

./server/mpm/winnt/mpm_winnt.c:1713

AH00455: %s configured -- resuming normal operations"

./server/mpm/winnt/mpm_winnt.c:1720

AH00456: Server built: %s", ap_get_server_built()

./server/mpm/winnt/mpm_winnt.c:1723

AH00457: Accepting new connections again: "%u active conns, %u idle workers"

./server/mpm/event/event.c:405

AH00458: pid %" APR_PID_T_FMT " taking over scoreboard slot from "%" APR_PID_T_FMT "%s"

./server/mpm/event/event.c:570

AH00459: sigaction(SIGTERM)"

./server/mpm/event/event.c:701

AH00460: sigaction(" AP_SIG_GRACEFUL_STOP_STRING ")"

./server/mpm/event/event.c:705

AH00461: sigaction(SIGINT)"

./server/mpm/event/event.c:710

AH00462: sigaction(SIGXCPU)"

./server/mpm/event/event.c:716

AH00463: sigaction(SIGXFSZ)"

./server/mpm/event/event.c:725

AH00464: sigaction(SIGPIPE)"

./server/mpm/event/event.c:731

AH00465: sigaction(SIGHUP)"

./server/mpm/event/event.c:741

AH00466: sigaction(" AP_SIG_GRACEFUL_STRING ")"

./server/mpm/event/event.c:744

AH00467: %s: apr_pollset_add failure", op->tag

./server/mpm/event/event.c:796

AH00468: "error closing socket"

./server/mpm/event/event.c:891

AH00469: process_socket: connection aborted"

./server/mpm/event/event.c:946

AH00470: network write failure in core output filter"

./server/mpm/event/event.c:1008

AH00471: "push2worker: ap_queue_push failed"

./server/mpm/event/event.c:1227

AH00472: ap_queue_info_wait_for_idler failed. "Attempting to shutdown process gracefully"

./server/mpm/event/event.c:1267

AH00473: apr_pollset_remove failed"

./server/mpm/event/event.c:1392

AH00474: apr_thread_create: unable to create listener thread"

./server/mpm/event/event.c:1916

AH00475: the listener thread didn't stop accepting"

./server/mpm/event/event.c:2092

AH00476: apr_thread_join: unable to join listener thread"

./server/mpm/event/event.c:2098

AH00477: apr_thread_join: unable to join worker "thread %d", i

./server/mpm/event/event.c:2108

AH00478: apr_thread_join: unable to join the start " "thread"

./server/mpm/event/event.c:2126

AH00479: Couldn't initialize signal thread"

./server/mpm/event/event.c:2166

AH00480: apr_thread_create: unable to create worker thread"

./server/mpm/event/event.c:2203

AH00481: fork: Unable to fork new process"

./server/mpm/event/event.c:2302

AH00482: processor unbind failed"

./server/mpm/event/event.c:2329

AH00483: No active workers found..." Apache is exiting!"

./server/mpm/event/event.c:2476

AH00484: server reached MaxRequestWorkers setting, "consider raising the MaxRequestWorkers "setting"

./server/mpm/event/event.c:2498

AH00485: scoreboard is full, not at MaxRequestWorkers"

./server/mpm/event/event.c:2506

AH00486: server seems busy, (you may need "to increase StartServers, ThreadsPerChild "or Min/MaxSpareThreads), "spawning %d children, there are around %d idle "threads, and %d total children", free_length

./server/mpm/event/event.c:2516

AH00487: Ignoring fatal error in child of previous "generation (pid %ld)."

./server/mpm/event/event.c:2572

AH00488: long lost child came home! (pid %ld)"

./server/mpm/event/event.c:2623

AH00489: %s configured -- resuming normal operations"

./server/mpm/event/event.c:2698

AH00490: Server built: %s", ap_get_server_built()

./server/mpm/event/event.c:2701

AH00491: "caught SIGTERM, shutting down"

./server/mpm/event/event.c:2722

AH00492: caught " AP_SIG_GRACEFUL_STOP_STRING, shutting down gracefully"

./server/mpm/event/event.c:2741

AH00493:

./server/mpm/event/event.c:2797

AH00494: SIGHUP received. Attempting to restart"

./server/mpm/event/event.c:2818

AH00495: apr_pollset_create failed; check system or user limits"

./server/mpm/event/event.c:2894

AH00496: apr_proc_detach failed"

./server/mpm/event/event.c:2906

AH00497: WARNING: ServerLimit of %d exceeds compile-time "limit of", server_limit

./server/mpm/event/event.c:2941

AH00498: ServerLimit of %d exceeds compile-time limit "of %d, decreasing to match"

./server/mpm/event/event.c:2948

AH00499: WARNING: ServerLimit of %d not allowed, "increasing to 1.", server_limit

./server/mpm/event/event.c:2957

AH00500: ServerLimit of %d not allowed, increasing to 1"

./server/mpm/event/event.c:2961

AH00501: changing ServerLimit to %d from original value of %d "not allowed during restart"

./server/mpm/event/event.c:2976

AH00502: WARNING: ThreadLimit of %d exceeds compile-time "limit of", thread_limit

./server/mpm/event/event.c:2985

AH00503: ThreadLimit of %d exceeds compile-time limit "of %d, decreasing to match"

./server/mpm/event/event.c:2992

AH00504: WARNING: ThreadLimit of %d not allowed, "increasing to 1.", thread_limit

./server/mpm/event/event.c:3001

AH00505: ThreadLimit of %d not allowed, increasing to 1"

./server/mpm/event/event.c:3005

AH00506: changing ThreadLimit to %d from original value of %d "not allowed during restart"

./server/mpm/event/event.c:3020

AH00507: WARNING: ThreadsPerChild of %d exceeds ThreadLimit "of", threads_per_child

./server/mpm/event/event.c:3029

AH00508: ThreadsPerChild of %d exceeds ThreadLimit "of %d, decreasing to match"

./server/mpm/event/event.c:3039

AH00509: WARNING: ThreadsPerChild of %d not allowed, "increasing to 1.", threads_per_child

./server/mpm/event/event.c:3048

AH00510: ThreadsPerChild of %d not allowed, increasing to 1"

./server/mpm/event/event.c:3052

AH00511: WARNING: MaxRequestWorkers of %d is less than "ThreadsPerChild of", max_workers

./server/mpm/event/event.c:3061

AH00512: MaxRequestWorkers of %d is less than ThreadsPerChild "of %d, increasing to match"

./server/mpm/event/event.c:3071

AH00513: WARNING: MaxRequestWorkers of %d is not an integer "multiple of", max_workers

./server/mpm/event/event.c:3085

AH00514: MaxRequestWorkers of %d is not an integer multiple "of ThreadsPerChild of %d, decreasing to nearest "multiple %d", max_workers, threads_per_child

./server/mpm/event/event.c:3096

AH00515: WARNING: MaxRequestWorkers of %d would require %d "servers and ", max_workers, ap_daemons_limit

./server/mpm/event/event.c:3107

AH00516: MaxRequestWorkers of %d would require %d servers and "exceed ServerLimit of %d, decreasing to %d"

./server/mpm/event/event.c:3117

AH00517: WARNING: StartServers of %d not allowed, "increasing to 1.", ap_daemons_to_start

./server/mpm/event/event.c:3129

AH00518: StartServers of %d not allowed, increasing to 1"

./server/mpm/event/event.c:3133

AH00519: WARNING: MinSpareThreads of %d not allowed, "increasing to 1", min_spare_threads

./server/mpm/event/event.c:3142

AH00520: MinSpareThreads of %d not allowed, increasing to 1"

./server/mpm/event/event.c:3150

AH00521: MaxClients is deprecated, use MaxRequestWorkers "instead."

./server/mpm/event/event.c:3230

AH00522: write pipe_of_death"

./server/mpm/event/pod.c:94

AH00523: handler \"%s\" not found for: %s", r->handler, r->filename

./server/config.c:436

AH00524: Handler for %s returned invalid result code %d"

./server/config.c:450

AH00525: Cannot remove module %s: not found in module list"

./server/config.c:669

AH00526: Syntax error on line %d of %s:"

./server/config.c:2036

AH00529: %s pcfg_openfile: unable to check htaccess file, "ensure it is readable and that '%s' "is executable"

./server/config.c:2112

AH00530: initialisation: bug or getaddrinfo fail"

./server/config.c:2303

AH00532: "Invalid config file path %s"

./server/config.c:2380

AH00534: %s: Configuration error: %s", ap_server_argv0, error

./server/config.c:2394

AH00538: %s %% escape in unescape('%s') at %s:%d"

./server/util_expr_eval.c:1083

AH00539: XML request body is larger than the configured "limit of %lu", (unsigned long)limit_xml_body

./server/util_xml.c:88

AH00540: XML parser error (at end). status=%d", status

./server/util_xml.c:114

AH00541: XML Parser Error: %s", errbuf

./server/util_xml.c:126

AH00542: apr_socket_opt_set: (TCP_NODELAY)"

./server/mpm_common.c:214

AH00543: %s: bad user name %s", ap_server_argv0, name

./server/mpm_common.c:229

AH00544: %s: bad group name %s", ap_server_argv0, name

./server/mpm_common.c:247

AH00545: MaxRequestsPerChild is deprecated, use "MaxConnectionsPerChild instead."

./server/mpm_common.c:321

AH00546: no record of generation %d of exiting child %" APR_PID_T_FMT

./server/mpm_common.c:508

AH00547: Could not resolve host name %s -- ignoring!", host

./server/vhost.c:201

AH00548: NameVirtualHost has no effect and will be removed in the "next release %s:%d"

./server/vhost.c:258

AH00549: Failed to resolve server name "for %s (check DNS) -- or specify an explicit "ServerName"

./server/vhost.c:646

AH00550: Client sent malformed Host header"

./server/vhost.c:757

AH00551: Done with config file %s", cfp->name

./server/util.c:822

AH00552: Internal error: pcfg_openfile() called with NULL filename"

./server/util.c:857

AH00553: Opening config file %s (%s)"

./server/util.c:865

AH00554: Access to file %s denied by server: not a regular file"

./server/util.c:883

AH00555: "Read config: '%s'", buf

./server/util.c:1077

AH00556: %s: apr_gethostname() failed to determine ServerName"

./server/util.c:2059

AH00557: %s: apr_sockaddr_info_get() failed for %s"

./server/util.c:2076

AH00558: %s: Could not reliably determine the server's fully qualified "domain name, using %s. Set the 'ServerName' directive globally "to suppress this message"

./server/util.c:2085

AH00560: "Request header "exceeds LimitRequestFieldSize after merging: %s", key

./server/protocol.c:699

AH00561: Request header exceeds LimitRequestFieldSize: "%.*s", field_name_len(field), field

./server/protocol.c:759

AH00562: Request header exceeds LimitRequestFieldSize "after folding: %.*s"

./server/protocol.c:789

AH00563: Number of request headers exceeds "LimitRequestFields"

./server/protocol.c:818

AH00564: Request header field is missing ':' "separator: %.*s", (int)LOG_NAME_MAX_LEN

./server/protocol.c:834

AH00565: request failed: URI too long (longer than %d)"

./server/protocol.c:971

AH00566: request failed: invalid characters in URI"

./server/protocol.c:976

AH00567: request failed: error reading the headers"

./server/protocol.c:1013

AH00568: client sent invalid HTTP/0.9 request: HEAD %s"

./server/protocol.c:1038

AH00569: client sent HTTP/1.1 request without hostname "(see RFC2616 section 14.23): %s", r->uri

./server/protocol.c:1080

AH00570: client sent an unrecognized expectation value of "Expect: %s", expect

./server/protocol.c:1123

AH00571: "need AuthType to note auth failure: %s", r->uri

./server/protocol.c:1247

AH00572: "need AuthName: %s", r->uri

./server/protocol.c:1274

AH00573: client used wrong authentication scheme: %s", r->uri

./server/protocol.c:1285

AH00574: ap_content_length_filter: "apr_bucket_read() failed"

./server/protocol.c:1379

AH00575: Status is %d - not sending interim response", r->status

./server/protocol.c:1736

AH00576: The DBM driver could not be loaded"

./modules/dav/fs/dbm.c:100

AH00577: "Error writing propdb: %s", err->desc

./modules/dav/fs/dbm.c:498

AH00578: \"DAV Off\" cannot be used to turn off a subtree "of a DAV-enabled location."

./modules/dav/main/mod_dav.c:184

AH00579: A subtree cannot specify a different DAV provider "than its parent."

./modules/dav/main/mod_dav.c:190

AH00580: An invalid Depth header was specified."

./modules/dav/main/mod_dav.c:659

AH00581: An invalid Overwrite header was specified."

./modules/dav/main/mod_dav.c:682

AH00582: Depth must be \"infinity\" for DELETE of a collection."

./modules/dav/main/mod_dav.c:1189

AH00583: Depth of \"1\" is not allowed for DELETE."

./modules/dav/main/mod_dav.c:1196

AH00584: The \"options\" element was not found."

./modules/dav/main/mod_dav.c:1614

AH00585: The \"propfind\" element was not found."

./modules/dav/main/mod_dav.c:2049

AH00586: The \"propfind\" element does not contain one of "the required child elements (the specific command)."

./modules/dav/main/mod_dav.c:2070

AH00587: The request body does not contain "a \"propertyupdate\" element."

./modules/dav/main/mod_dav.c:2302

AH00588: A \"prop\" element is missing inside "the propertyupdate command."

./modules/dav/main/mod_dav.c:2365

AH00589: Unknown Transfer-Encoding %s", tenc

./modules/dav/main/mod_dav.c:2444

AH00590: Invalid Content-Length %s", lenp

./modules/dav/main/mod_dav.c:2460

AH00591: The request is missing a Destination header."

./modules/dav/main/mod_dav.c:2652

AH00592: %s", lookup.err.desc

./modules/dav/main/mod_dav.c:2661

AH00593: Depth must be \"0\" or \"infinity\" for COPY or MOVE."

./modules/dav/main/mod_dav.c:2740

AH00594: Depth must be \"infinity\" when moving a collection."

./modules/dav/main/mod_dav.c:2746

AH00595: Depth must be 0 or \"infinity\" for LOCK."

./modules/dav/main/mod_dav.c:3035

AH00596: Unlock failed (%s): "No Lock-Token specified in header", r->filename

./modules/dav/main/mod_dav.c:3208

AH00597: The request body does not contain "a \"version-control\" element."

./modules/dav/main/mod_dav.c:3318

AH00598: The \"version-control\" element does not contain "a \"version\" element."

./modules/dav/main/mod_dav.c:3326

AH00599: The \"version\" element does not contain "an \"href\" element."

./modules/dav/main/mod_dav.c:3333

AH00600: An \"href\" element does not contain a URI."

./modules/dav/main/mod_dav.c:3343

AH00601: The request body, if present, must be a "DAV:checkout element."

./modules/dav/main/mod_dav.c:3495

AH00602: Within the DAV:activity-set element, the "DAV:new element must be used, or at least "one DAV:href must be specified."

./modules/dav/main/mod_dav.c:3542

AH00603: The request body, if present, must be a "DAV:checkin element."

./modules/dav/main/mod_dav.c:3695

AH00604: The request body does not contain "an \"update\" element."

./modules/dav/main/mod_dav.c:3783

AH00605: The version element does not contain "an \"href\" element."

./modules/dav/main/mod_dav.c:3795

AH00606: The \"update\" element does not contain "a \"label-name\" or \"version\" element."

./modules/dav/main/mod_dav.c:3802

AH00607: Depth must be zero for UPDATE with a version"

./modules/dav/main/mod_dav.c:3810

AH00608: A \"label-name\" or \"href\" element does not contain "any content."

./modules/dav/main/mod_dav.c:3819

AH00609: %s", lookup.err.desc

./modules/dav/main/mod_dav.c:3852

AH00610: The request body does not contain "a \"label\" element."

./modules/dav/main/mod_dav.c:3999

AH00611: The \"label\" element does not contain "an \"add\", \"set\", or \"remove\" element."

./modules/dav/main/mod_dav.c:4016

AH00612: The label command element does not contain "a \"label-name\" element."

./modules/dav/main/mod_dav.c:4024

AH00613: A \"label-name\" element does not contain "a label name."

./modules/dav/main/mod_dav.c:4033

AH00614: The request body must specify a report."

./modules/dav/main/mod_dav.c:4101

AH00615: The request body does not contain "a \"mkworkspace\" element."

./modules/dav/main/mod_dav.c:4176

AH00616: The request body must be present and must be a "DAV:merge element."

./modules/dav/main/mod_dav.c:4310

AH00617: The DAV:merge element must contain a DAV:source "element."

./modules/dav/main/mod_dav.c:4318

AH00618: The DAV:source element must contain a DAV:href "element."

./modules/dav/main/mod_dav.c:4325

AH00619: %s", lookup.err.desc

./modules/dav/main/mod_dav.c:4338

AH00620: The request is missing a Destination header."

./modules/dav/main/mod_dav.c:4451

AH00621: %s", lookup.err.desc

./modules/dav/main/mod_dav.c:4460

AH00622: buggy client used un-escaped hash in Request-URI"

./modules/dav/main/mod_dav.c:4624

AH00623: Failed to query lock-null status for %s"

./modules/dav/main/util_lock.c:721

AH00624: Failed to create memory pool"

./modules/database/mod_dbd.c:524

AH00625: driver for %s not available", cfg->name

./modules/database/mod_dbd.c:541

AH00626: can't find driver for %s", cfg->name

./modules/database/mod_dbd.c:545

AH00627: driver for %s is invalid or corrupted"

./modules/database/mod_dbd.c:549

AH00628: mod_dbd not compatible with APR in get_driver"

./modules/database/mod_dbd.c:554

AH00629: Can't connect to %s: %s", cfg->name, err

./modules/database/mod_dbd.c:565

AH00630: mod_dbd not compatible with APR in open"

./modules/database/mod_dbd.c:569

AH00631: Failed to create memory pool"

./modules/database/mod_dbd.c:586

AH00632: failed to prepare SQL statements: %s"

./modules/database/mod_dbd.c:596

AH00633: failed to initialise"

./modules/database/mod_dbd.c:650

AH00634: Failed to create reslist cleanup memory pool"

./modules/database/mod_dbd.c:672

AH00635: Failed to create thread mutex"

./modules/database/mod_dbd.c:692

AH00636: child init failed!"

./modules/database/mod_dbd.c:706

AH00637: Failed to acquire thread mutex"

./modules/database/mod_dbd.c:726

AH00638: Failed to release thread mutex"

./modules/database/mod_dbd.c:737

AH00639: DBD [%s] Error: %s", svr->cfg->name, errmsg

./modules/database/mod_dbd.c:785

AH00640: Can't evaluate condition: %s", err

./modules/loggers/mod_log_debug.c:70

AH00641: Can't evaluate message expression: %s", err

./modules/loggers/mod_log_debug.c:79

AH00644: Error evaluating log condition: %s", err

./modules/loggers/mod_log_config.c:1095

AH00645: log writer isn't correctly setup"

./modules/loggers/mod_log_config.c:1123

AH00646: "Error writing to %s"

./modules/loggers/mod_log_config.c:1129

AH00647: could not initialize buffered log mutex, "transfer log may become corrupted"

./modules/loggers/mod_log_config.c:1482

AH00648: invalid transfer log path %s.", name

./modules/loggers/mod_log_config.c:1564

AH00649: could not open transfer log file %s.", fname

./modules/loggers/mod_log_config.c:1570

AH00650: couldn't spawn forensic log pipe %s", cfg->logname

./modules/loggers/mod_log_forensic.c:84

AH00651: could not open forensic log file %s.", fname

./modules/loggers/mod_log_forensic.c:97

AH00652: File does not exist: %s", r->filename

./modules/mappers/mod_actions.c:190

AH00653: "%s", desc

./modules/mappers/mod_rewrite.c:1121

AH00654: mod_rewrite: could not start RewriteMap "program %s", map->checkfile

./modules/mappers/mod_rewrite.c:1197

AH00655: mod_rewrite: can't open text RewriteMap file %s", file

./modules/mappers/mod_rewrite.c:1228

AH00656: mod_rewrite: can't open DBM RewriteMap %s", file

./modules/mappers/mod_rewrite.c:1290

AH00657: rewritemap: error %s querying for %s", errmsg, key

./modules/mappers/mod_rewrite.c:1326

AH00658: rewritemap: error %s looking up %s", errmsg, key

./modules/mappers/mod_rewrite.c:1344

AH00659: apr_global_mutex_lock(rewrite_mapr_lock_acquire) "failed"

./modules/mappers/mod_rewrite.c:1394

AH00660: apr_global_mutex_unlock(rewrite_mapr_lock_acquire) "failed"

./modules/mappers/mod_rewrite.c:1506

AH00661: mod_rewrite: can't access text RewriteMap file %s"

./modules/mappers/mod_rewrite.c:1549

AH00662: mod_rewrite: can't access DBM RewriteMap file %s"

./modules/mappers/mod_rewrite.c:1590

AH00663: mod_rewrite: can't access DBM RewriteMap "file %s", s->checkfile2

./modules/mappers/mod_rewrite.c:1599

AH00664: RewriteOptions: MaxRedirects option has been "removed in favor of the global "LimitInternalRecursion directive and will be "ignored."

./modules/mappers/mod_rewrite.c:2890

AH00665: RewriteCond: NoCase option for non-regex pattern '%s' "is not supported and will be ignored. (%s:%d)", a2

./modules/mappers/mod_rewrite.c:3305

AH00666: mod_rewrite: could not init rewrite_mapr_lock_acquire" in child"

./modules/mappers/mod_rewrite.c:4348

AH00667: mod_rewrite: could not init map cache in child"

./modules/mappers/mod_rewrite.c:4356

AH00669: attempt to make remote request from mod_rewrite "without proxy enabled: %s", r->filename

./modules/mappers/mod_rewrite.c:4513

AH00670: Options FollowSymLinks and SymLinksIfOwnerMatch are both off, "so the RewriteRule directive is also forbidden "due to its similar ability to circumvent directory restrictions : "%s", r->filename

./modules/mappers/mod_rewrite.c:4735

AH00671: The %s directive in %s at line %d will probably "never match because it overlaps an earlier "%sAlias%s."

./modules/mappers/mod_alias.c:140

AH00672: Regex substitution in '%s' failed. "Replacement too long?", alias->real

./modules/mappers/mod_alias.c:386

AH00673: incomplete redirection target of '%s' for "URI '%s' modified to '%s'"

./modules/mappers/mod_alias.c:457

AH00674: cannot redirect '%s' to '%s'; "target is not a valid absoluteURI or abs_path"

./modules/mappers/mod_alias.c:464

AH00675: incomplete redirection target of '%s' for "URI '%s' modified to '%s'"

./modules/mappers/mod_alias.c:508

AH00676: cannot redirect '%s' to '%s'; "target is not a valid absoluteURI or abs_path"

./modules/mappers/mod_alias.c:515

AH00677: invalid base directive in map file: %s", r->uri

./modules/mappers/mod_imagemap.c:377

AH00678: invalid directory name in map file: %s", r->uri

./modules/mappers/mod_imagemap.c:437

AH00679: map file %s, line %d syntax error: requires at "least two fields", r->uri, imap->line_number

./modules/mappers/mod_imagemap.c:847

AH00680: dont_fiddle_headers=%d use_rvsa=%d ua_supports_trans=%d "send_alternates=%d, may_choose=%d"

./modules/mappers/mod_negotiation.c:688

AH00681: Syntax error in type map, no ':' in %s for header %s"

./modules/mappers/mod_negotiation.c:919

AH00682: Syntax error in type map --- no header body: %s for %s"

./modules/mappers/mod_negotiation.c:930

AH00683: cannot access type map file: %s", rr->filename

./modules/mappers/mod_negotiation.c:958

AH00684: Parse error in type map, Content-Length: "'%s' in %s is invalid."

./modules/mappers/mod_negotiation.c:1002

AH00685: Syntax error in type map, no end tag '%s'"found in %s for Body: content."

./modules/mappers/mod_negotiation.c:1037

AH00686: cannot read directory for multi: %s", neg->dir_name

./modules/mappers/mod_negotiation.c:1122

AH00687: Negotiation: discovered file(s) matching request: %s" (None could be negotiated)."

./modules/mappers/mod_negotiation.c:1294

AH00688: Variant: file=%s type=%s lang=%s sourceq=%1.3f "mimeq=%1.3f langq=%1.3f charq=%1.3f encq=%1.3f "q=%1.5f definite=%d"

./modules/mappers/mod_negotiation.c:2066

AH00689: Variant: file=%s type=%s lang=%s sourceq=%1.3f "mimeq=%1.3f langq=%1.3f langidx=%d charq=%1.3f encq=%1.3f "

./modules/mappers/mod_negotiation.c:2137

AH00690: no acceptable variant: %s", r->filename

./modules/mappers/mod_negotiation.c:2906

AH00691: cache: Removing url %s from the cache", h->cache_obj->key

./modules/cache/cache_storage.c:49

AH00692: cache: No cache request information available for key" generation"

./modules/cache/cache_storage.c:81

AH00693: cache: No cache request information available for key" generation"

./modules/cache/cache_storage.c:206

AH00694: "cache_select_url(): Vary header mismatch."

./modules/cache/cache_storage.c:286

AH00695: Cached response for %s isn't fresh. Adding/replacing "conditional request headers.", r->uri

./modules/cache/cache_storage.c:320

AH00696: cache: 'only-if-cached' requested and no cached entity, "returning 504 Gateway Timeout for: %s", r->uri

./modules/cache/cache_storage.c:383

AH00697: cache: No cache request information available for key" generation"

./modules/cache/cache_storage.c:409

AH00698: cache: Key for entity %s?%s is %s", r->uri

./modules/cache/cache_storage.c:671

AH00699: rename tempfile to file failed:" %s -> %s", file->tempfile, file->file

./modules/cache/mod_cache_disk.c:176

AH00700: URL %s partial content response not cached"

./modules/cache/mod_cache_disk.c:353

AH00701: URL %s failed the size check "(%" APR_OFF_T_FMT " > %" APR_OFF_T_FMT ")"

./modules/cache/mod_cache_disk.c:361

AH00702: URL %s failed the size check "(%" APR_OFF_T_FMT " < %" APR_OFF_T_FMT ")"

./modules/cache/mod_cache_disk.c:368

AH00703: Cannot cache files to disk without a CacheRoot specified."

./modules/cache/mod_cache_disk.c:427

AH00704: Cannot parse vary header file: %s"

./modules/cache/mod_cache_disk.c:467

AH00705: File '%s' has a version mismatch. File had version: %d."

./modules/cache/mod_cache_disk.c:488

AH00706: Cannot read header file %s", dobj->hdrs.file

./modules/cache/mod_cache_disk.c:524

AH00707: HEAD request cached, non-HEAD requested, ignoring: %s"

./modules/cache/mod_cache_disk.c:534

AH00708: Cannot open data file %s", dobj->data.file

./modules/cache/mod_cache_disk.c:552

AH00709: Recalled cached URL info header %s", dobj->name

./modules/cache/mod_cache_disk.c:569

AH00710: Cached URL info header '%s' didn't match body, ignoring this entry"

./modules/cache/mod_cache_disk.c:590

AH00711: Deleting %s from cache.", dobj->hdrs.file

./modules/cache/mod_cache_disk.c:617

AH00712: Failed to delete headers file %s from cache."

./modules/cache/mod_cache_disk.c:625

AH00713: Deleting %s from cache.", dobj->data.file

./modules/cache/mod_cache_disk.c:634

AH00714: Failed to delete data file %s from cache."

./modules/cache/mod_cache_disk.c:642

AH00715: Deleting directory %s from cache", dir

./modules/cache/mod_cache_disk.c:674

AH00716: Premature end of vary array."

./modules/cache/mod_cache_disk.c:700

AH00717: Premature end of cache headers."

./modules/cache/mod_cache_disk.c:769

AH00718: CGI Interface Error: Script headers apparently ASCII: (CGI = %s)"

./modules/cache/mod_cache_disk.c:812

AH00719: recalling headers; but no header fd for %s", dobj->name

./modules/cache/mod_cache_disk.c:851

AH00720: Recalled headers for URL %s", dobj->name

./modules/cache/mod_cache_disk.c:865

AH00721: could not create vary file %s"

./modules/cache/mod_cache_disk.c:970

AH00722: could not write to vary file %s"

./modules/cache/mod_cache_disk.c:979

AH00723: could not write to vary file %s"

./modules/cache/mod_cache_disk.c:991

AH00724: could not close vary file %s"

./modules/cache/mod_cache_disk.c:1006

AH00725: could not create header file %s"

./modules/cache/mod_cache_disk.c:1027

AH00726: could not write info to header file %s"

./modules/cache/mod_cache_disk.c:1056

AH00727: could not write out-headers to header file %s"

./modules/cache/mod_cache_disk.c:1067

AH00728: could not write in-headers to header file %s"

./modules/cache/mod_cache_disk.c:1081

AH00729: could not close header file %s"

./modules/cache/mod_cache_disk.c:1092

AH00730: Error when reading bucket for URL %s"

./modules/cache/mod_cache_disk.c:1163

AH00731: Error when writing cache file for URL %s"

./modules/cache/mod_cache_disk.c:1203

AH00732: URL %s failed the size check "(%" APR_OFF_T_FMT ">%" APR_OFF_T_FMT ")"

./modules/cache/mod_cache_disk.c:1212

AH00733: Discarding body for URL %s "because connection has been aborted."

./modules/cache/mod_cache_disk.c:1254

AH00734: URL %s failed the size check "(%" APR_OFF_T_FMT "<%" APR_OFF_T_FMT ")"

./modules/cache/mod_cache_disk.c:1263

AH00735: URL %s didn't receive complete response, not caching"

./modules/cache/mod_cache_disk.c:1274

AH00736: commit_entity: URL '%s' not cached due to earlier disk error."

./modules/cache/mod_cache_disk.c:1313

AH00737: commit_entity: Headers and body for URL %s cached."

./modules/cache/mod_cache_disk.c:1318

AH00738: "distributed scache failed to obtain context"

./modules/cache/mod_socache_dc.c:77

AH00739: "distributed scache context initialised"

./modules/cache/mod_socache_dc.c:80

AH00740: "distributed scache 'store' failed"

./modules/cache/mod_socache_dc.c:107

AH00741: "distributed scache 'store' successful"

./modules/cache/mod_socache_dc.c:110

AH00742: "distributed scache 'retrieve' MISS"

./modules/cache/mod_socache_dc.c:123

AH00743: "distributed scache 'retrieve' OVERFLOW"

./modules/cache/mod_socache_dc.c:127

AH00744: "distributed scache 'retrieve' HIT"

./modules/cache/mod_socache_dc.c:131

AH00745: "distributed scache 'remove' MISS"

./modules/cache/mod_socache_dc.c:141

AH00746: "distributed scache 'remove' HIT"

./modules/cache/mod_socache_dc.c:144

AH00747: distributed scache 'socache_dc_status'"

./modules/cache/mod_socache_dc.c:151

AH00748: Invalidating all cached entities in response to '%s' request for %s"

./modules/cache/mod_cache.c:120

AH00749: "Adding CACHE_SAVE_SUBREQ filter for %s"

./modules/cache/mod_cache.c:166

AH00750: "Adding CACHE_SAVE filter for %s"

./modules/cache/mod_cache.c:174

AH00751: Adding CACHE_REMOVE_URL filter for %s"

./modules/cache/mod_cache.c:183

AH00752: "Cache locked for url, not caching "response: %s", r->uri

./modules/cache/mod_cache.c:200

AH00753: "Restoring request headers for %s"

./modules/cache/mod_cache.c:207

AH00754: Restoring request headers."

./modules/cache/mod_cache.c:229

AH00755: Invalidating all cached entities in response to '%s' request for %s"

./modules/cache/mod_cache.c:393

AH00756: "Adding CACHE_SAVE_SUBREQ filter for %s"

./modules/cache/mod_cache.c:439

AH00757: "Adding CACHE_SAVE filter for %s"

./modules/cache/mod_cache.c:445

AH00758: "Replacing CACHE with CACHE_SAVE "filter for %s", r->uri

./modules/cache/mod_cache.c:468

AH00759: Adding CACHE_REMOVE_URL filter for %s"

./modules/cache/mod_cache.c:478

AH00760: "Cache locked for url, not caching "response: %s", r->uri

./modules/cache/mod_cache.c:496

AH00761: "Replacing CACHE with CACHE_OUT filter for %s"

./modules/cache/mod_cache.c:544

AH00762: CACHE/CACHE_OUT filter enabled while caching is disabled, ignoring"

./modules/cache/mod_cache.c:589

AH00763: cache: running CACHE_OUT filter"

./modules/cache/mod_cache.c:595

AH00764: cache: serving %s", r->uri

./modules/cache/mod_cache.c:617

AH00765: cache: Cache provider's store_body failed!"

./modules/cache/mod_cache.c:652

AH00766: cache: Cache provider's store_body returned an "empty brigade, but didn't consume all of the"input brigade, standing down to prevent a spin"

./modules/cache/mod_cache.c:690

AH00767: CACHE/CACHE_SAVE filter enabled while caching is disabled, ignoring"

./modules/cache/mod_cache.c:755

AH00768: cache: %s not cached. Reason: %s", r->unparsed_uri

./modules/cache/mod_cache.c:1102

AH00769: cache: Caching url: %s", r->unparsed_uri

./modules/cache/mod_cache.c:1221

AH00770: cache: Removing CACHE_REMOVE_URL filter."

./modules/cache/mod_cache.c:1227

AH00771: "cache: Last modified is in the future, "replacing with now"

./modules/cache/mod_cache.c:1274

AH00772: cache: updating headers with store_headers failed. "Removing cached url."

./modules/cache/mod_cache.c:1405

AH00773: cache: attempt to remove url from cache unsuccessful."

./modules/cache/mod_cache.c:1414

AH00774: cache: store_headers failed"

./modules/cache/mod_cache.c:1440

AH00775: cache: CACHE_REMOVE_URL enabled unexpectedly"

./modules/cache/mod_cache.c:1495

AH00776: cache: CACHE filter was added in quick handler mode and "will be ignored: %s", f->r->unparsed_uri

./modules/cache/mod_cache.c:1536

AH00777: cache: CACHE filter was added twice, or was added where "the cache has been bypassed and will be ignored: %s"

./modules/cache/mod_cache.c:1542

AH00778: Could not create a cache lock directory: %s"

./modules/cache/cache_util.c:308

AH00779: Could not stat a cache lock file: %s"

./modules/cache/cache_util.c:320

AH00780: Cache lock file for '%s' too old, removing: %s"

./modules/cache/cache_util.c:327

AH00781: Incoming request is asking for a uncached version of "%s, but we have been configured to ignore it and "serve a cached response anyway"

./modules/cache/cache_util.c:537

AH00782: Cache lock obtained for stale cached URL, "revalidating entry: %s"

./modules/cache/cache_util.c:710

AH00783: Cache already locked for stale cached URL, "pretend it is fresh: %s"

./modules/cache/cache_util.c:718

AH00784: Attempt to obtain a cache lock for stale "cached URL failed, revalidating entry anyway: %s"

./modules/cache/cache_util.c:735

AH00785: Failed to create Memcache Object of '%d' size."

./modules/cache/mod_socache_memcache.c:105

AH00786: Failed to Parse memcache Server: '%s'", split

./modules/cache/mod_socache_memcache.c:122

AH00787: Failed to Parse Server, "no hostname specified: '%s'", split

./modules/cache/mod_socache_memcache.c:128

AH00788: Failed to Create memcache Server: %s:%d"

./modules/cache/mod_socache_memcache.c:146

AH00789: Failed to Add memcache Server: %s:%d"

./modules/cache/mod_socache_memcache.c:154

AH00790: scache_mc: error setting key '%s' "with %d bytes of data", buf, nData

./modules/cache/mod_socache_memcache.c:218

AH00791: scache_mc: 'retrieve' FAIL"

./modules/cache/mod_socache_memcache.c:246

AH00792: scache_mc: 'retrieve' OVERFLOW"

./modules/cache/mod_socache_memcache.c:252

AH00793: scache_mc: error deleting key '%s' "

./modules/cache/mod_socache_memcache.c:277

AH00794: invalid file path "%s, skipping", filename

./modules/cache/mod_file_cache.c:136

AH00795: unable to stat(%s), skipping", fspec

./modules/cache/mod_file_cache.c:143

AH00796: %s isn't a regular file, skipping", fspec

./modules/cache/mod_file_cache.c:148

AH00797: %s is too large to cache, skipping", fspec

./modules/cache/mod_file_cache.c:153

AH00798: unable to open(%s, O_RDONLY), skipping", fspec

./modules/cache/mod_file_cache.c:161

AH00799: unable to mmap %s, skipping", filename

./modules/cache/mod_file_cache.c:181

AH00800: unable to cache file: %s. Sendfile is not supported on this OS", filename

./modules/cache/mod_file_cache.c:212

AH00801: unable to cache file: %s. MMAP is not supported by this OS", filename

./modules/cache/mod_file_cache.c:223

AH00802: Can't change owner of %s", name

./modules/cache/mod_socache_dbm.c:108

AH00803: could not use default path '%s' for DBM socache"

./modules/cache/mod_socache_dbm.c:133

AH00804: Cannot create socache DBM file `%s'"

./modules/cache/mod_socache_dbm.c:145

AH00805: data size too large for DBM socache: %d >= %d"

./modules/cache/mod_socache_dbm.c:204

AH00806: data size too large for DBM socache: %d >= %d"

./modules/cache/mod_socache_dbm.c:211

AH00807: Cannot open socache DBM file `%s' for writing "(store)"

./modules/cache/mod_socache_dbm.c:233

AH00808: Cannot store socache object to DBM file `%s'"

./modules/cache/mod_socache_dbm.c:241

AH00809: Cannot open socache DBM file `%s' for reading "(fetch)"

./modules/cache/mod_socache_dbm.c:286

AH00810: Cannot open socache DBM file `%s' for writing "(delete)"

./modules/cache/mod_socache_dbm.c:342

AH00811: Cannot open socache DBM file `%s' for "scanning"

./modules/cache/mod_socache_dbm.c:406

AH00812: Cannot re-open socache DBM file `%s' for "expiring"

./modules/cache/mod_socache_dbm.c:439

AH00813: DBM socache expiry: "old: %d, new: %d, removed: %d"

./modules/cache/mod_socache_dbm.c:455

AH00814: Cannot open socache DBM file `%s' for status "retrival"

./modules/cache/mod_socache_dbm.c:478

AH00815: Cannot open socache DBM file `%s' for "iterating", ctx->data_file

./modules/cache/mod_socache_dbm.c:525

AH00816: dbm `%s' entry iterated", ctx->data_file

./modules/cache/mod_socache_dbm.c:546

AH00817: Failure reading first/next socache DBM file `%s' record"

./modules/cache/mod_socache_dbm.c:556

AH00818: Could not use default path '%s' for shmcb socache"

./modules/cache/mod_socache_shmcb.c:354

AH00819: Could not allocate shared memory segment for shmcb "socache"

./modules/cache/mod_socache_shmcb.c:368

AH00820: shared memory segment too small"

./modules/cache/mod_socache_shmcb.c:378

AH00821: shmcb_init allocated %" APR_SIZE_T_FMT bytes of shared memory"

./modules/cache/mod_socache_shmcb.c:382

AH00822: for %" APR_SIZE_T_FMT " bytes (%" APR_SIZE_T_FMT including header), recommending %u subcaches, "%u indexes each", shm_segsize

./modules/cache/mod_socache_shmcb.c:396

AH00823: shared memory segment too small"

./modules/cache/mod_socache_shmcb.c:403

AH00824: shmcb_init_memory choices follow"

./modules/cache/mod_socache_shmcb.c:431

AH00825: subcache_num = %u", header->subcache_num

./modules/cache/mod_socache_shmcb.c:433

AH00826: subcache_size = %u", header->subcache_size

./modules/cache/mod_socache_shmcb.c:435

AH00827: subcache_data_offset = %u", header->subcache_data_offset

./modules/cache/mod_socache_shmcb.c:437

AH00828: subcache_data_size = %u", header->subcache_data_size

./modules/cache/mod_socache_shmcb.c:439

AH00829: index_num = %u", header->index_num

./modules/cache/mod_socache_shmcb.c:441

AH00830: Shared memory socache initialised"

./modules/cache/mod_socache_shmcb.c:449

AH00831: socache_shmcb_store (0x%02x -> subcache %d)"

./modules/cache/mod_socache_shmcb.c:475

AH00832: "unusably short id provided "(%u bytes)", idlen

./modules/cache/mod_socache_shmcb.c:480

AH00833: can't store an socache entry!"

./modules/cache/mod_socache_shmcb.c:487

AH00834: leaving socache_shmcb_store successfully"

./modules/cache/mod_socache_shmcb.c:497

AH00835: socache_shmcb_retrieve (0x%02x -> subcache %d)"

./modules/cache/mod_socache_shmcb.c:512

AH00836: leaving socache_shmcb_retrieve successfully"

./modules/cache/mod_socache_shmcb.c:523

AH00837: socache_shmcb_remove (0x%02x -> subcache %d)"

./modules/cache/mod_socache_shmcb.c:537

AH00838: "unusably short id provided "(%u bytes)", idlen

./modules/cache/mod_socache_shmcb.c:541

AH00839: leaving socache_shmcb_remove successfully"

./modules/cache/mod_socache_shmcb.c:552

AH00840: "inside shmcb_status"

./modules/cache/mod_socache_shmcb.c:570

AH00841: "leaving shmcb_status"

./modules/cache/mod_socache_shmcb.c:630

AH00842: expiring %u and reclaiming %u removed socache entries"

./modules/cache/mod_socache_shmcb.c:683

AH00843: we now have %u socache entries", subcache->idx_used

./modules/cache/mod_socache_shmcb.c:703

AH00844: inserting socache entry larger (%d) than subcache data area (%d)"

./modules/cache/mod_socache_shmcb.c:719

AH00845: about to force-expire, subcache: idx_used=%d, "data_used=%d", subcache->idx_used, subcache->data_used

./modules/cache/mod_socache_shmcb.c:737

AH00846: finished force-expire, subcache: idx_used=%d, "data_used=%d", subcache->idx_used, subcache->data_used

./modules/cache/mod_socache_shmcb.c:764

AH00847: insert happened at idx=%d, data=(%u:%u)", new_idx

./modules/cache/mod_socache_shmcb.c:800

AH00848: finished insert, subcache: idx_pos/idx_used=%d/%d, "data_pos/data_used=%d/%d"

./modules/cache/mod_socache_shmcb.c:803

AH00849: match at idx=%d, data=%d", pos, idx->data_pos

./modules/cache/mod_socache_shmcb.c:836

AH00850: shmcb_subcache_retrieve discarding expired entry"

./modules/cache/mod_socache_shmcb.c:858

AH00851: shmcb_subcache_retrieve found no match"

./modules/cache/mod_socache_shmcb.c:868

AH00852: possible match at idx=%d, data=%d", pos, idx->data_pos

./modules/cache/mod_socache_shmcb.c:891

AH00853: shmcb_subcache_remove removing matching entry"

./modules/cache/mod_socache_shmcb.c:896

AH00854: iterating idx=%d, data=%d", pos, idx->data_pos

./modules/cache/mod_socache_shmcb.c:931

AH00855: shmcb entry iterated"

./modules/cache/mod_socache_shmcb.c:973

AH00856: shmcb_subcache_iterate discarding expired entry"

./modules/cache/mod_socache_shmcb.c:981

AH00857: error parsing URL %s: %s", url, err

./modules/proxy/mod_proxy_scgi.c:188

AH00858: sending data to %s:%u failed"

./modules/proxy/mod_proxy_scgi.c:228

AH00859: receiving request body failed"

./modules/proxy/mod_proxy_scgi.c:339

AH00860: error reading response headers from %s:%u"

./modules/proxy/mod_proxy_scgi.c:374

AH00861: Found %s: %s - preparing subrequest."

./modules/proxy/mod_proxy_scgi.c:394

AH00862: Internal redirect to %s", req_conf->location

./modules/proxy/mod_proxy_scgi.c:445

AH00863: File subrequest to %s", req_conf->location

./modules/proxy/mod_proxy_scgi.c:460

AH00864: Subrequest to file '%s' not possible. "(rr->status=%d, rr->finfo.filetype=%d)"

./modules/proxy/mod_proxy_scgi.c:476

AH00865: declining URL %s", url

./modules/proxy/mod_proxy_scgi.c:509

AH00866: failed to make connection to backend: %s:%u"

./modules/proxy/mod_proxy_scgi.c:532

AH00867: "error parsing URL %s: %s"

./modules/proxy/mod_proxy_ajp.c:53

AH00868: request failed to %pI (%s)"

./modules/proxy/mod_proxy_ajp.c:211

AH00869: ajp_alloc_data_msg failed"

./modules/proxy/mod_proxy_ajp.c:238

AH00870: "request is chunked"

./modules/proxy/mod_proxy_ajp.c:248

AH00871: ap_get_brigade failed"

./modules/proxy/mod_proxy_ajp.c:259

AH00872: "APR_BUCKET_IS_EOS"

./modules/proxy/mod_proxy_ajp.c:267

AH00873: data to read (max %" APR_SIZE_T_FMT at %" APR_SIZE_T_FMT ")", bufsiz, msg->pos

./modules/proxy/mod_proxy_ajp.c:271

AH00874: apr_brigade_flatten"

./modules/proxy/mod_proxy_ajp.c:280

AH00875: got %" APR_SIZE_T_FMT " bytes of data", bufsiz

./modules/proxy/mod_proxy_ajp.c:286

AH00876: send failed to %pI (%s)"

./modules/proxy/mod_proxy_ajp.c:295

AH00877: read zero bytes, expecting" %" APR_OFF_T_FMT " bytes"

./modules/proxy/mod_proxy_ajp.c:309

AH00878: read response failed from %pI (%s)"

./modules/proxy/mod_proxy_ajp.c:335

AH00879: APR_BUCKET_IS_EOS"

./modules/proxy/mod_proxy_ajp.c:382

AH00880: ap_get_brigade failed"

./modules/proxy/mod_proxy_ajp.c:390

AH00881: apr_brigade_flatten failed"

./modules/proxy/mod_proxy_ajp.c:400

AH00882: ajp_send_data_msg failed"

./modules/proxy/mod_proxy_ajp.c:412

AH00883: ap_proxy_ajp_request error read after end"

./modules/proxy/mod_proxy_ajp.c:423

AH00884: Backend sent headers twice."

./modules/proxy/mod_proxy_ajp.c:434

AH00885: ap_proxy_ajp_request: origin server "sent 401 without WWW-Authenticate header"

./modules/proxy/mod_proxy_ajp.c:449

AH00886: Ignoring flush message "received before headers"

./modules/proxy/mod_proxy_ajp.c:473

AH00887: error processing body.%s"

./modules/proxy/mod_proxy_ajp.c:512

AH00888: error processing end"

./modules/proxy/mod_proxy_ajp.c:541

AH00889: ajp_read_header failed"

./modules/proxy/mod_proxy_ajp.c:581

AH00890: Processing of request failed backend: %i, "output: %i", backend_failed, output_failed

./modules/proxy/mod_proxy_ajp.c:596

AH00891: Processing of request didn't terminate cleanly"

./modules/proxy/mod_proxy_ajp.c:607

AH00892: got response from %pI (%s)"

./modules/proxy/mod_proxy_ajp.c:622

AH00893: dialog to %pI (%s) failed"

./modules/proxy/mod_proxy_ajp.c:641

AH00894: "declining URL %s", url

./modules/proxy/mod_proxy_ajp.c:724

AH00895: "serving URL %s", url

./modules/proxy/mod_proxy_ajp.c:727

AH00896: failed to make connection to backend: %s"

./modules/proxy/mod_proxy_ajp.c:757

AH00897: cping/cpong failed to %pI (%s)"

./modules/proxy/mod_proxy_ajp.c:776

AH00898: "%s returned by %s", message

./modules/proxy/proxy_util.c:379

AH00899: "%s", err

./modules/proxy/proxy_util.c:404

AH00900: Warning: NetMask not supplied with IP-Addr; guessing: %s/%ld"

./modules/proxy/proxy_util.c:507

AH00901: Warning: NetMask and IP-Addr disagree in %s/%ld"

./modules/proxy/proxy_util.c:516

AH00902: Set to %s/%ld", inet_ntoa(This->addr), bits

./modules/proxy/proxy_util.c:520

AH00903: 1)IP-Match: %s[%s] <-> ", host, inet_ntoa(addr)

./modules/proxy/proxy_util.c:557

AH00904: %s/", inet_ntoa(This->addr)

./modules/proxy/proxy_util.c:559

AH00905: %s", inet_ntoa(This->mask)

./modules/proxy/proxy_util.c:561

AH00906: 1)IP-NoMatch: %s[%s] <-> ", host, inet_ntoa(addr)

./modules/proxy/proxy_util.c:568

AH00907: %s/", inet_ntoa(This->addr)

./modules/proxy/proxy_util.c:570

AH00908: %s", inet_ntoa(This->mask)

./modules/proxy/proxy_util.c:572

AH00909: 2)IP-NoMatch: hostname=%s msg=Host not found", host

./modules/proxy/proxy_util.c:583

AH00910: 3)IP-Match: %s[%s] <-> ", host, inet_ntoa(*ip)

./modules/proxy/proxy_util.c:595

AH00911: %s/", inet_ntoa(This->addr)

./modules/proxy/proxy_util.c:597

AH00912: %s", inet_ntoa(This->mask)

./modules/proxy/proxy_util.c:599

AH00913: 3)IP-NoMatch: %s[%s] <-> ", host, inet_ntoa(*ip)

./modules/proxy/proxy_util.c:606

AH00914: %s/", inet_ntoa(This->addr)

./modules/proxy/proxy_util.c:608

AH00915: %s", inet_ntoa(This->mask)

./modules/proxy/proxy_util.c:610

AH00916: connect to remote machine %s blocked: name %s "matched", uri_addr->hostname, npent[j].name

./modules/proxy/proxy_util.c:778

AH00917: connect to remote machine %s blocked: "IP %s matched", uri_addr->hostname, conf_ip

./modules/proxy/proxy_util.c:794

AH00918: no provider for %s", balancer->s->name

./modules/proxy/proxy_util.c:1212

AH00919: no mutex %s", balancer->s->name

./modules/proxy/proxy_util.c:1221

AH00920: Failed to reopen mutex %s in child"

./modules/proxy/proxy_util.c:1231

AH00921: "slotmem_attach failed"

./modules/proxy/proxy_util.c:1240

AH00922: can not create balancer thread mutex"

./modules/proxy/proxy_util.c:1249

AH00923: Pooled connection 0x%pp for worker %s has been" already returned to the connection pool.", conn

./modules/proxy/proxy_util.c:1312

AH00924: worker %s shared already initialized", worker->s->name

./modules/proxy/proxy_util.c:1635

AH00925: initializing worker %s shared", worker->s->name

./modules/proxy/proxy_util.c:1639

AH00926: worker %s local already initialized", worker->s->name

./modules/proxy/proxy_util.c:1675

AH00927: initializing worker %s local", worker->s->name

./modules/proxy/proxy_util.c:1679

AH00928: can not create worker thread mutex"

./modules/proxy/proxy_util.c:1685

AH00929: can not create connection pool"

./modules/proxy/proxy_util.c:1693

AH00930: initialized pool in child %" APR_PID_T_FMT " for (%s) min=%d max=%d smax=%d"

./modules/proxy/proxy_util.c:1709

AH00931: initialized single connection worker in child %" APR_PID_T_FMT " for (%s)"

./modules/proxy/proxy_util.c:1726

AH00932: %s: worker for (%s) has been marked for retry"

./modules/proxy/proxy_util.c:1745

AH00933: %s: too soon to retry worker for (%s)"

./modules/proxy/proxy_util.c:1751

AH00934: all workers are busy. Unable to serve %s", *url

./modules/proxy/proxy_util.c:1813

AH00935: %s: error creating fam %d socket for target %s"

./modules/proxy/proxy_util.c:1853

AH00936: apr_socket_opt_set(SO_RCVBUF): Failed to set "ProxyReceiveBufferSize, using default"

./modules/proxy/proxy_util.c:1868

AH00937: apr_socket_opt_set(APR_TCP_NODELAY): "Failed to set"

./modules/proxy/proxy_util.c:1875

AH00938: %s: failed to bind socket to local address"

./modules/proxy/proxy_util.c:1895

AH00939: %s: attempt to connect to %pI (%s) failed"

./modules/proxy/proxy_util.c:1908

AH00940: %s: disabled connection for (%s)"

./modules/proxy/proxy_util.c:1931

AH00941: %s: failed to acquire connection for (%s)"

./modules/proxy/proxy_util.c:1954

AH00942: %s: has acquired connection for (%s)"

./modules/proxy/proxy_util.c:1959

AH00943: %s: has released connection for (%s)"

./modules/proxy/proxy_util.c:1974

AH00944: connecting %s to %s:%d", *url, uri->hostname, uri->port

./modules/proxy/proxy_util.c:2012

AH00945: "lock"

./modules/proxy/proxy_util.c:2083

AH00946: "unlock"

./modules/proxy/proxy_util.c:2099

AH00947: connected %s to %s:%d", *url, conn->hostname, conn->port

./modules/proxy/proxy_util.c:2133

AH00948: CONNECT: sending the CONNECT request for %s:%d "to the remote proxy %pI (%s)"

./modules/proxy/proxy_util.c:2226

AH00949: send_http_connect: response from the forward proxy: %s"

./modules/proxy/proxy_util.c:2280

AH00950: send_http_connect: the forward proxy returned code is '%s'"

./modules/proxy/proxy_util.c:2291

AH00951: %s: backend socket is disconnected."

./modules/proxy/proxy_util.c:2322

AH00952: %s: error creating fam %d socket for target %s"

./modules/proxy/proxy_util.c:2332

AH00953: apr_socket_opt_set(SO_RCVBUF): Failed to set "ProxyReceiveBufferSize, using default"

./modules/proxy/proxy_util.c:2350

AH00954: apr_socket_opt_set(APR_TCP_NODELAY): "Failed to set"

./modules/proxy/proxy_util.c:2357

AH00955: apr_socket_opt_set(SO_KEEPALIVE): Failed to set" Keepalive"

./modules/proxy/proxy_util.c:2379

AH00956: %s: failed to bind socket to local address"

./modules/proxy/proxy_util.c:2394

AH00957: %s: attempt to connect to %pI (%s) failed"

./modules/proxy/proxy_util.c:2407

AH00958: %s: attempt to connect to %s:%d "via http CONNECT through %pI (%s) failed"

./modules/proxy/proxy_util.c:2442

AH00959: ap_proxy_connect_backend disabling worker for (%s) for %"

./modules/proxy/proxy_util.c:2466

AH00960: "%s: an error occurred creating a "new connection to %pI (%s)", proxy_function

./modules/proxy/proxy_util.c:2513

AH00961: "%s: failed to enable ssl support "for %pI (%s)", proxy_function

./modules/proxy/proxy_util.c:2525

AH00962: %s: connection complete to %pI (%s)"

./modules/proxy/proxy_util.c:2536

AH00963: %s: pre_connection setup failed (%d)"

./modules/proxy/proxy_util.c:2550

AH00964: Unhandled bucket type of type %s in" proxy_buckets_lifetime_transform", e->type->name

./modules/proxy/mod_proxy_http.c:731

AH00965: "worker slotmem_dptr failed"

./modules/proxy/proxy_util.c:2689

AH00966: "Cannot init worker"

./modules/proxy/proxy_util.c:2717

AH00967: ajp_marshal_into_msgb - No such method %s"

./modules/proxy/ajp_header.c:229

AH00968: ajp_marshal_into_msgb: "Error appending the message begining"

./modules/proxy/ajp_header.c:257

AH00969: ajp_marshal_into_msgb: "Error appending the header name"

./modules/proxy/ajp_header.c:270

AH00970: ajp_marshal_into_msgb: "Error appending the header name"

./modules/proxy/ajp_header.c:278

AH00971: ajp_marshal_into_msgb: "Error appending the header value"

./modules/proxy/ajp_header.c:286

AH00972: ajp_marshal_into_msgb: "Error appending the remote user"

./modules/proxy/ajp_header.c:311

AH00973: ajp_marshal_into_msgb: "Error appending the auth type"

./modules/proxy/ajp_header.c:320

AH00974: ajp_marshal_into_msgb: "Error appending the query string"

./modules/proxy/ajp_header.c:330

AH00975: ajp_marshal_into_msgb: "Error appending the jvm route"

./modules/proxy/ajp_header.c:339

AH00976: ajp_marshal_into_msgb: "Error appending the SSL certificates"

./modules/proxy/ajp_header.c:362

AH00977: ajp_marshal_into_msgb: "Error appending the SSL ciphers"

./modules/proxy/ajp_header.c:374

AH00978: ajp_marshal_into_msgb: "Error appending the SSL session"

./modules/proxy/ajp_header.c:386

AH00979: ajp_marshal_into_msgb: "Error appending the SSL key size"

./modules/proxy/ajp_header.c:400

AH00980: ajp_marshal_into_msgb: "Error appending attribute %s=%s"

./modules/proxy/ajp_header.c:420

AH00981: ajp_marshal_into_msgb: "Error appending attribute %s=%s"

./modules/proxy/ajp_header.c:435

AH00982: ajp_marshal_into_msgb: "Error appending the message end"

./modules/proxy/ajp_header.c:445

AH00983: ajp_unmarshal_response: Null status"

./modules/proxy/ajp_header.c:500

AH00984: ajp_unmarshal_response: "No such sc (%08x)"

./modules/proxy/ajp_header.c:555

AH00985: ajp_unmarshal_response: "Null header name"

./modules/proxy/ajp_header.c:565

AH00986: ajp_unmarshal_response: "Null header value"

./modules/proxy/ajp_header.c:575

AH00987: ajp_send_header: ajp_msg_create failed"

./modules/proxy/ajp_header.c:627

AH00988: ajp_send_header: ajp_marshal_into_msgb failed"

./modules/proxy/ajp_header.c:634

AH00989: ajp_send_header: ajp_ilink_send failed"

./modules/proxy/ajp_header.c:642

AH00990: ajp_read_header: ajp_msg_reuse failed"

./modules/proxy/ajp_header.c:664

AH00991: ajp_read_header: ajp_msg_create failed"

./modules/proxy/ajp_header.c:672

AH00992: ajp_read_header: ajp_ilink_receive failed"

./modules/proxy/ajp_header.c:680

AH00993: ajp_read_header: ajp_msg_peek_uint8 failed"

./modules/proxy/ajp_header.c:687

AH00994: ajp_parse_headers: ajp_msg_get_byte failed"

./modules/proxy/ajp_header.c:717

AH00995: ajp_parse_headers: wrong type %s (0x%02x) expecting %s (0x%02x)"

./modules/proxy/ajp_header.c:722

AH00996: ajp_parse_data: ajp_msg_get_byte failed"

./modules/proxy/ajp_header.c:741

AH00997: ajp_parse_data: wrong type %s (0x%02x) expecting %s (0x%02x)"

./modules/proxy/ajp_header.c:746

AH00998: ajp_parse_data: Wrong chunk length. Length of chunk is %i," expected length is %i.", *len, expected_len

./modules/proxy/ajp_header.c:768

AH00999: ajp_parse_reuse: ajp_msg_get_byte failed"

./modules/proxy/ajp_header.c:786

AH01000: ajp_parse_reuse: wrong type %s (0x%02x) expecting %s (0x%02x)"

./modules/proxy/ajp_header.c:791

AH01001: "proxy_express: Enabled"

./modules/proxy/mod_proxy_express.c:125

AH01002: proxy_express: Opening DBM file: %s (%s)"

./modules/proxy/mod_proxy_express.c:131

AH01003: proxy_express: looking for %s", name

./modules/proxy/mod_proxy_express.c:141

AH01004: proxy_express: found %s -> %s", name, backend

./modules/proxy/mod_proxy_express.c:157

AH01005: proxy_express: rewritten as: %s", r->filename

./modules/proxy/mod_proxy_express.c:163

AH01006: proxy_express: adding PPR entry"

./modules/proxy/mod_proxy_express.c:185

AH01007: ajp_handle_cping_cpong: ajp_msg_create failed"

./modules/proxy/ajp_utils.c:38

AH01008: ajp_handle_cping_cpong: ajp_marshal_into_msgb failed"

./modules/proxy/ajp_utils.c:45

AH01009: ajp_handle_cping_cpong: ajp_ilink_send failed"

./modules/proxy/ajp_utils.c:53

AH01010: ajp_handle_cping_cpong: apr_socket_timeout_get failed"

./modules/proxy/ajp_utils.c:60

AH01011: ajp_handle_cping_cpong: apr_socket_timeout_set failed"

./modules/proxy/ajp_utils.c:68

AH01012: ajp_handle_cping_cpong: ajp_ilink_receive failed"

./modules/proxy/ajp_utils.c:77

AH01013: ajp_handle_cping_cpong: invalid CPONG message"

./modules/proxy/ajp_utils.c:85

AH01014: ajp_handle_cping_cpong: awaited CPONG, received %d "

./modules/proxy/ajp_utils.c:90

AH01015: ajp_handle_cping_cpong: apr_socket_timeout_set failed"

./modules/proxy/ajp_utils.c:101

AH01016: read %" APR_OFF_T_FMT bytes from %s", len, name

./modules/proxy/mod_proxy_connect.c:167

AH01017: error on %s - ap_pass_brigade"

./modules/proxy/mod_proxy_connect.c:176

AH01018: error on %s - ap_get_brigade"

./modules/proxy/mod_proxy_connect.c:181

AH01019: connecting %s to %s:%d", url, uri.hostname, uri.port

./modules/proxy/mod_proxy_connect.c:246

AH01020: error apr_pollset_create()"

./modules/proxy/mod_proxy_connect.c:329

AH01021: an error occurred creating a new connection "to %pI (%s)", connect_addr, connectname

./modules/proxy/mod_proxy_connect.c:356

AH01022: pre_connection setup failed (%d)", rc

./modules/proxy/mod_proxy_connect.c:366

AH01023: "error apr_poll()"

./modules/proxy/mod_proxy_connect.c:438

AH01024: woke from poll(), i=%d", pollcnt

./modules/proxy/mod_proxy_connect.c:442

AH01025: sock was readable"

./modules/proxy/mod_proxy_connect.c:453

AH01026: err/hup on backconn"

./modules/proxy/mod_proxy_connect.c:461

AH01027: client was readable"

./modules/proxy/mod_proxy_connect.c:471

AH01028: unknown socket in pollset"

./modules/proxy/mod_proxy_connect.c:479

AH01029: ajp_ilink_send(): send failed"

./modules/proxy/ajp_link.c:37

AH01030: ajp_ilink_receive() can't receive header"

./modules/proxy/ajp_link.c:85

AH01031: ajp_ilink_receive() received bad header"

./modules/proxy/ajp_link.c:93

AH01032: ajp_ilink_receive() error while receiving message body "of length %" APR_SIZE_T_FMT

./modules/proxy/ajp_link.c:101

AH01033: ajp_ilink_receive() received packet len=%" APR_SIZE_T_FMTtype=%d"

./modules/proxy/ajp_link.c:108

AH01034: proxy_ftp: could not parse line %s"

./modules/proxy/mod_proxy_ftp.c:691

AH01035: missing or failed auth to %s"

./modules/proxy/mod_proxy_ftp.c:921

AH01036: connecting %s to %s:%d", url, connectname, connectport

./modules/proxy/mod_proxy_ftp.c:1107

AH01037: "lock"

./modules/proxy/mod_proxy_ftp.c:1113

AH01038: "unlock"

./modules/proxy/mod_proxy_ftp.c:1132

AH01039: an error occurred creating a new connection to %pI (%s)"

./modules/proxy/mod_proxy_ftp.c:1176

AH01040: error creating EPSV socket"

./modules/proxy/mod_proxy_ftp.c:1415

AH01041: apr_socket_opt_set(SO_RCVBUF): Failed to "set ProxyReceiveBufferSize, using default"

./modules/proxy/mod_proxy_ftp.c:1424

AH01042: apr_socket_opt_set(APR_TCP_NODELAY): "Failed to set"

./modules/proxy/mod_proxy_ftp.c:1431

AH01043: EPSV attempt to connect to %pI failed - "Firewall/NAT?", epsv_addr

./modules/proxy/mod_proxy_ftp.c:1442

AH01044: PASV contacting host %d.%d.%d.%d:%d"

./modules/proxy/mod_proxy_ftp.c:1501

AH01045: error creating PASV socket"

./modules/proxy/mod_proxy_ftp.c:1506

AH01046: apr_socket_opt_set(SO_RCVBUF): Failed to set ProxyReceiveBufferSize, using default"

./modules/proxy/mod_proxy_ftp.c:1515

AH01047: apr_socket_opt_set(APR_TCP_NODELAY): "Failed to set"

./modules/proxy/mod_proxy_ftp.c:1521

AH01048: PASV attempt to connect to %pI failed - Firewall/NAT?", pasv_addr

./modules/proxy/mod_proxy_ftp.c:1530

AH01049: error creating local socket"

./modules/proxy/mod_proxy_ftp.c:1551

AH01050: error setting reuseaddr option"

./modules/proxy/mod_proxy_ftp.c:1563

AH01051: error binding to ftp data socket %pI", local_addr

./modules/proxy/mod_proxy_ftp.c:1573

AH01052: error listening to ftp data socket %pI", local_addr

./modules/proxy/mod_proxy_ftp.c:1581

AH01053: failed to accept data connection"

./modules/proxy/mod_proxy_ftp.c:1926

AH01054: an error occurred creating the transfer connection"

./modules/proxy/mod_proxy_ftp.c:1942

AH01055: pre_connection setup failed (%d)", rc

./modules/proxy/mod_proxy_ftp.c:1956

AH01056: proxy: readbytes: %#x", readbytes

./modules/proxy/mod_proxy_ftp.c:1994

AH01057: data connection closed"

./modules/proxy/mod_proxy_ftp.c:2016

AH01058: "data connection closed"

./modules/proxy/mod_proxy_ftp.c:2049

AH01059: error parsing URL %s: %s", url, err

./modules/proxy/mod_proxy_fcgi.c:94

AH01060: set r->filename to %s", r->filename

./modules/proxy/mod_proxy_fcgi.c:119

AH01061: set r->path_info to %s", r->path_info

./modules/proxy/mod_proxy_fcgi.c:125

AH01062: sending env var '%s' value '%s'"

./modules/proxy/mod_proxy_fcgi.c:320

AH01063: truncating environment to %d bytes and %d elements"

./modules/proxy/mod_proxy_fcgi.c:336

AH01064: HEADER: %s %s", asc_line, hex_line

./modules/proxy/mod_proxy_fcgi.c:502

AH01065: "HEADER: %s %s"

./modules/proxy/mod_proxy_fcgi.c:537

AH01066: "HEADER: -EOH-"

./modules/proxy/mod_proxy_fcgi.c:541

AH01067: Failed to read entire header "got %" APR_SIZE_T_FMT " wanted %d"

./modules/proxy/mod_proxy_fcgi.c:674

AH01068: Got bogus version %d", (int) header.version

./modules/proxy/mod_proxy_fcgi.c:685

AH01069: Got bogus rid %d, expected %d"

./modules/proxy/mod_proxy_fcgi.c:697

AH01070: Error parsing script headers"

./modules/proxy/mod_proxy_fcgi.c:752

AH01071: Got error '%s'", readbuf

./modules/proxy/mod_proxy_fcgi.c:831

AH01072: Got bogus record %d", type

./modules/proxy/mod_proxy_fcgi.c:846

AH01073: Failed Writing Request to %s:", server_portstr

./modules/proxy/mod_proxy_fcgi.c:893

AH01074: Failed writing Environment to %s:", server_portstr

./modules/proxy/mod_proxy_fcgi.c:902

AH01075: Error dispatching request to %s:", server_portstr

./modules/proxy/mod_proxy_fcgi.c:911

AH01076: url: %s proxyname: %s proxyport: %d"

./modules/proxy/mod_proxy_fcgi.c:942

AH01077: "declining URL %s", url

./modules/proxy/mod_proxy_fcgi.c:950

AH01078: "serving URL %s", url

./modules/proxy/mod_proxy_fcgi.c:954

AH01079: failed to make connection to backend: %s"

./modules/proxy/mod_proxy_fcgi.c:988

AH01080: ajp_msg_check_header() got bad signature %02x%02x"

./modules/proxy/ajp_msg.c:154

AH01081: ajp_msg_check_header() incoming message is "too big %" APR_SIZE_T_FMT ", max is %" APR_SIZE_T_FMT

./modules/proxy/ajp_msg.c:165

AH01082: ajp_msg_copy(): destination buffer too "small %" APR_SIZE_T_FMT ", max size is %" APR_SIZE_T_FMT

./modules/proxy/ajp_msg.c:581

AH01083: error parsing URL %s: %s", url, err

./modules/proxy/mod_proxy_http.c:65

AH01084: pass request body failed to %pI (%s)"

./modules/proxy/mod_proxy_http.c:270

AH01085: could not parse request Content-Length (%s)"

./modules/proxy/mod_proxy_http.c:443

AH01086: read more bytes of request body than expected "(got %" APR_OFF_T_FMT ", expected %" APR_OFF_T_FMT ")"

./modules/proxy/mod_proxy_http.c:480

AH01087: client %s given Content-Length did not match" number of body bytes read", r->connection->client_ip

./modules/proxy/mod_proxy_http.c:533

AH01088: Request body is larger than the configured "limit of %" APR_OFF_T_FMT, limit

./modules/proxy/mod_proxy_http.c:591

AH01089: search for temporary directory failed"

./modules/proxy/mod_proxy_http.c:603

AH01090: creation of temporary file in directory "%s failed", temp_dir

./modules/proxy/mod_proxy_http.c:612

AH01091: write to temporary file %s failed"

./modules/proxy/mod_proxy_http.c:632

AH01092: no HTTP 0.9 request (with no host line) "on incoming request and preserve host set "forcing hostname to be %s for uri %s"

./modules/proxy/mod_proxy_http.c:834

AH01093: %s Transfer-Encoding is not supported", old_te_val

./modules/proxy/mod_proxy_http.c:1046

AH01094: client %s (%s) requested Transfer-Encoding "chunked body with Content-Length (C-L ignored)"

./modules/proxy/mod_proxy_http.c:1052

AH01095: prefetch request body failed to %pI (%s)" from %s (%s)"

./modules/proxy/mod_proxy_http.c:1076

AH01096: processing prefetched request body failed" to %pI (%s) from %s (%s)"

./modules/proxy/mod_proxy_http.c:1098

AH01097: pass request body failed to %pI (%s) from %s (%s)"

./modules/proxy/mod_proxy_http.c:1238

AH01098: Starting body due to bogus non-header "in headers returned by %s (%s)"

./modules/proxy/mod_proxy_http.c:1403

AH01099: No HTTP headers returned by %s (%s)"

./modules/proxy/mod_proxy_http.c:1410

AH01100: Ignoring bogus HTTP header returned by %s (%s)"

./modules/proxy/mod_proxy_http.c:1418

AH01101: could not set 100-Continue timeout"

./modules/proxy/mod_proxy_http.c:1546

AH01102: error reading status line from remote "server %s:%d", backend->hostname, backend->port

./modules/proxy/mod_proxy_http.c:1575

AH01103: "read timeout"

./modules/proxy/mod_proxy_http.c:1579

AH01104: Closing connection to client because" reading from backend server %s:%d failed." Number of keepalives %i", backend->hostname

./modules/proxy/mod_proxy_http.c:1599

AH01105: NOT Closing connection to client" although reading from backend server %s:%d" failed."

./modules/proxy/mod_proxy_http.c:1634

AH01106: bad HTTP/%d.%d header returned by %s (%s)"

./modules/proxy/mod_proxy_http.c:1705

AH01107: server %s:%d returned Transfer-Encoding" and Content-Length"

./modules/proxy/mod_proxy_http.c:1745

AH01108: undefined proxy interim response policy"

./modules/proxy/mod_proxy_http.c:1851

AH01109: origin server sent 401 without "WWW-Authenticate header"

./modules/proxy/mod_proxy_http.c:1865

AH01110: error reading response"

./modules/proxy/mod_proxy_http.c:1990

AH01111: readbytes: %#x", readbytes

./modules/proxy/mod_proxy_http.c:2005

AH01112: HTTPS: declining URL %s (mod_ssl not configured?)"

./modules/proxy/mod_proxy_http.c:2163

AH01113: "HTTP: declining URL %s"

./modules/proxy/mod_proxy_http.c:2172

AH01114: HTTP: failed to make connection to backend: %s"

./modules/proxy/mod_proxy_http.c:2222

AH01115: HTTP: 100-Continue failed to %pI (%s)"

./modules/proxy/mod_proxy_http.c:2253

AH01116: proxy: Entering roundrobin for BALANCER %s (%d)"

./modules/proxy/examples/mod_lbmethod_rr.c:52

AH01117: proxy: Creating roundrobin ctx for BALANCER %s (%d)"

./modules/proxy/examples/mod_lbmethod_rr.c:61

AH01118: proxy: roundrobin index: %d (%d)"

./modules/proxy/examples/mod_lbmethod_rr.c:67

AH01119: serf: request returned: %d", ctx->rstatus

./modules/proxy/mod_serf.c:82

AH01120: "Closed Connection Error"

./modules/proxy/mod_serf.c:117

AH01121: "serf_bucket_response_status..."

./modules/proxy/mod_serf.c:284

AH01122: "serf_bucket_read(response)"

./modules/proxy/mod_serf.c:306

AH01123: SerfCluster: unable to find cluster %s", conf->url.hostname

./modules/proxy/mod_serf.c:436

AH01124: SerfCluster: unable to find provider %s", cluster->provider

./modules/proxy/mod_serf.c:444

AH01125: SerfCluster: %s is missing list servers provider.", cluster->provider

./modules/proxy/mod_serf.c:450

AH01126: SerfCluster: %s list servers returned failure", cluster->provider

./modules/proxy/mod_serf.c:461

AH01127: SerfCluster: %s failed to provide a list of servers", cluster->provider

./modules/proxy/mod_serf.c:467

AH01128: "Unable to resolve: %s", conf->url.hostname

./modules/proxy/mod_serf.c:488

AH01129: "mpm lied to us about supporting serf."

./modules/proxy/mod_serf.c:495

AH01130: "Unable to create temp request body buffer file."

./modules/proxy/mod_serf.c:536

AH01131: "failed to read request body"

./modules/proxy/mod_serf.c:546

AH01132: "failed to read request body"

./modules/proxy/mod_serf.c:553

AH01133: "serf_context_run() for %pI", address

./modules/proxy/mod_serf.c:582

AH01134: SerfCluster: Heartbeat unable to read '%s'", path

./modules/proxy/mod_serf.c:964

AH01135: Substitution in regular expression failed. "Replacement too long?"

./modules/proxy/mod_proxy.c:582

AH01136: Unescaped URL path matched ProxyPass; ignoring unsafe nocanon"

./modules/proxy/mod_proxy.c:627

AH01138: Domain missing: %s sent to %s%s%s", r->uri

./modules/proxy/mod_proxy.c:830

AH01139: TRACE forbidden by server configuration"

./modules/proxy/mod_proxy.c:916

AH01140: TRACE with request body is not allowed"

./modules/proxy/mod_proxy.c:934

AH01141: proxy_handler no URL in %s", r->filename

./modules/proxy/mod_proxy.c:943

AH01142: Trying to run scheme_handler against proxy"

./modules/proxy/mod_proxy.c:1009

AH01143: Running scheme %s handler (attempt %d)"

./modules/proxy/mod_proxy.c:1061

AH01144: No protocol handler was valid for the URL %s. "If you are using a DSO version of mod_proxy, make sure "the proxy submodules are included in the configuration "using LoadModule.", r->uri

./modules/proxy/mod_proxy.c:1103

AH01145: Sharing worker '%s' instead of creating new worker '%s'"

./modules/proxy/mod_proxy.c:1492

AH01146: Ignoring parameter '%s=%s' for worker '%s' because of worker sharing"

./modules/proxy/mod_proxy.c:1499

AH01147: Defining worker '%s' for balancer '%s'"

./modules/proxy/mod_proxy.c:1931

AH01148: Defined worker '%s' for balancer '%s'"

./modules/proxy/mod_proxy.c:1936

AH01149: Sharing worker '%s' instead of creating new worker '%s'"

./modules/proxy/mod_proxy.c:1942

AH01150: Ignoring parameter '%s=%s' for worker '%s' because of worker sharing"

./modules/proxy/mod_proxy.c:1951

AH01151: set r->filename to %s", r->filename

./modules/proxy/mod_proxy_fdpass.c:52

AH01152: Failed to connect to '%s'", url

./modules/proxy/mod_proxy_fdpass.c:198

AH01153: Unable to find configured flush provider '%s'"

./modules/proxy/mod_proxy_fdpass.c:211

AH01154: "send_socket failed:"

./modules/proxy/mod_proxy_fdpass.c:227

AH01155: failed to create dummy socket"

./modules/proxy/mod_proxy_fdpass.c:240

AH01156: ap_pass_brigade failed:"

./modules/proxy/mod_proxy_fdpass.c:267

AH01157: error parsing URL %s: %s"

./modules/proxy/mod_proxy_balancer.c:80

AH01158: Looking at %s -> %s initialized?", balancer->s->name, worker->s->name

./modules/proxy/mod_proxy_balancer.c:120

AH01159: Found value %s for stickysession %s"

./modules/proxy/mod_proxy_balancer.c:281

AH01160: Found value %s for stickysession %s"

./modules/proxy/mod_proxy_balancer.c:290

AH01161: "Found route %s", *route

./modules/proxy/mod_proxy_balancer.c:302

AH01162: Route changed from %s to %s"

./modules/proxy/mod_proxy_balancer.c:313

AH01163: %s: Lock failed for find_best_worker()"

./modules/proxy/mod_proxy_balancer.c:330

AH01164: %s: Unlock failed for find_best_worker()"

./modules/proxy/mod_proxy_balancer.c:342

AH01165: %s: Forcing recovery for worker (%s)"

./modules/proxy/mod_proxy_balancer.c:433

AH01166: %s: Lock failed for pre_request", (*balancer)->s->name

./modules/proxy/mod_proxy_balancer.c:465

AH01167: %s: All workers are in error state for route (%s)"

./modules/proxy/mod_proxy_balancer.c:526

AH01168: %s: Unlock failed for pre_request"

./modules/proxy/mod_proxy_balancer.c:530

AH01169: %s: Unlock failed for pre_request"

./modules/proxy/mod_proxy_balancer.c:539

AH01170: %s: All workers are in error state"

./modules/proxy/mod_proxy_balancer.c:547

AH01171: %s: No workers in balancer"

./modules/proxy/mod_proxy_balancer.c:551

AH01172: %s: worker (%s) rewritten to %s"

./modules/proxy/mod_proxy_balancer.c:599

AH01173: %s: Lock failed for post_request"

./modules/proxy/mod_proxy_balancer.c:615

AH01174: %s: Forcing recovery for worker (%s), "failonstatus %d"

./modules/proxy/mod_proxy_balancer.c:626

AH01175: %s: Unlock failed for post_request", balancer->s->name

./modules/proxy/mod_proxy_balancer.c:638

AH01176: proxy_balancer_post_request for (%s)", balancer->s->name

./modules/proxy/mod_proxy_balancer.c:641

AH01177: Failed to lookup provider 'shm' for '%s': is "mod_slotmem_shm loaded??"

./modules/proxy/mod_proxy_balancer.c:722

AH01178: "Doing balancers create: %d, %d (%d)"

./modules/proxy/mod_proxy_balancer.c:748

AH01179: "balancer slotmem_create failed"

./modules/proxy/mod_proxy_balancer.c:756

AH01180: mutex creation of %s : %s failed", balancer_mutex_type

./modules/proxy/mod_proxy_balancer.c:777

AH01181: "balancer slotmem_grab failed"

./modules/proxy/mod_proxy_balancer.c:788

AH01182: "balancer slotmem_dptr failed"

./modules/proxy/mod_proxy_balancer.c:793

AH01183: "Cannot share balancer"

./modules/proxy/mod_proxy_balancer.c:797

AH01184: "Doing workers create: %s (%s), %d, %d"

./modules/proxy/mod_proxy_balancer.c:802

AH01185: "worker slotmem_create failed"

./modules/proxy/mod_proxy_balancer.c:811

AH01186: "worker slotmem_grab failed"

./modules/proxy/mod_proxy_balancer.c:827

AH01187: "worker slotmem_dptr failed"

./modules/proxy/mod_proxy_balancer.c:832

AH01188: "Cannot share worker"

./modules/proxy/mod_proxy_balancer.c:836

AH01189: %s: Lock failed for balancer_handler"

./modules/proxy/mod_proxy_balancer.c:940

AH01190: %s: Unlock failed for balancer_handler"

./modules/proxy/mod_proxy_balancer.c:946

AH01191: "parsing r->args"

./modules/proxy/mod_proxy_balancer.c:954

AH01192: "settings worker params"

./modules/proxy/mod_proxy_balancer.c:1001

AH01193: settings balancer params"

./modules/proxy/mod_proxy_balancer.c:1051

AH01194: %s: Lock failed for adding worker"

./modules/proxy/mod_proxy_balancer.c:1106

AH01195: worker slotmem_grab failed"

./modules/proxy/mod_proxy_balancer.c:1116

AH01196: %s: Unlock failed for adding worker"

./modules/proxy/mod_proxy_balancer.c:1119

AH01197: worker slotmem_dptr failed"

./modules/proxy/mod_proxy_balancer.c:1126

AH01198: %s: Unlock failed for adding worker"

./modules/proxy/mod_proxy_balancer.c:1129

AH01199: Cannot share worker"

./modules/proxy/mod_proxy_balancer.c:1136

AH01200: %s: Unlock failed for adding worker"

./modules/proxy/mod_proxy_balancer.c:1139

AH01201: Cannot init worker"

./modules/proxy/mod_proxy_balancer.c:1146

AH01202: %s: Unlock failed for adding worker"

./modules/proxy/mod_proxy_balancer.c:1149

AH01203: %s: Unlock failed for adding worker"

./modules/proxy/mod_proxy_balancer.c:1161

AH01204: "genning page"

./modules/proxy/mod_proxy_balancer.c:1172

AH01205: "slotmem_attach failed"

./modules/proxy/mod_proxy_balancer.c:1429

AH01206: Failed to init balancer %s in child"

./modules/proxy/mod_proxy_balancer.c:1439

AH01207: proxy: Entering byrequests for BALANCER (%s)"

./modules/proxy/balancers/mod_lbmethod_byrequests.c:95

AH01208: proxy: byrequests selected worker \"%s\" : busy %" APR_SIZE_T_FMT " : lbstatus %d"

./modules/proxy/balancers/mod_lbmethod_byrequests.c:142

AH01209: proxy: Entering bytraffic for BALANCER (%s)"

./modules/proxy/balancers/mod_lbmethod_bytraffic.c:67

AH01210: proxy: bytraffic selected worker \"%s\" : busy %" APR_SIZE_T_FMT

./modules/proxy/balancers/mod_lbmethod_bytraffic.c:115

AH01211: proxy: Entering bybusyness for BALANCER (%s)"

./modules/proxy/balancers/mod_lbmethod_bybusyness.c:51

AH01212: proxy: bybusyness selected worker \"%s\" : busy %" APR_SIZE_T_FMT " : lbstatus %d"

./modules/proxy/balancers/mod_lbmethod_bybusyness.c:112

AH01213: lb_heartbeat: Unable to read heartbeats at '%s'"

./modules/proxy/balancers/mod_lbmethod_heartbeat.c:292

AH01214: lb_heartbeat: No server for worker %s", (*worker)->s->name

./modules/proxy/balancers/mod_lbmethod_heartbeat.c:306

AH01215: %s", argsbuffer

./modules/generators/mod_cgi.c:213

AH01216: couldn't set child process attributes: %s", r->filename

./modules/generators/mod_cgi.c:452

AH01217: apr_pollset_create(); check system or user limits"

./modules/generators/mod_cgi.c:590

AH01218: apr_pollset_add(); check system or user limits"

./modules/generators/mod_cgi.c:602

AH01219: apr_pollset_add(); check system or user limits"

./modules/generators/mod_cgi.c:611

AH01220: Timeout waiting for output from CGI script %s"

./modules/generators/mod_cgi.c:693

AH01221: poll failed waiting for CGI child"

./modules/generators/mod_cgi.c:706

AH01222: don't know how to spawn child process: %s"

./modules/generators/mod_cgi.c:823

AH01223: couldn't spawn child process: %s", r->filename

./modules/generators/mod_cgi.c:832

AH01224: Timeout during reading request entity data"

./modules/generators/mod_cgi.c:855

AH01225: Error reading request entity data"

./modules/generators/mod_cgi.c:859

AH01226: don't know how to spawn cmd child process: %s"

./modules/generators/mod_cgi.c:1133

AH01227: couldn't spawn child process: %s", r->filename

./modules/generators/mod_cgi.c:1143

AH01228: "exec used but not allowed "in %s", r->filename

./modules/generators/mod_cgi.c:1186

AH01229: "execution failure "for parameter \"%s\" to tag exec in file %s"

./modules/generators/mod_cgi.c:1206

AH01230: "invalid CGI ref "\"%s\" in %s", tag_val, file

./modules/generators/mod_cgi.c:1221

AH01231: "unknown parameter "\"%s\" to tag exec in %s", tag, file

./modules/generators/mod_cgi.c:1228

AH01232: suEXEC mechanism enabled (wrapper: %s)", SUEXEC_BIN

./modules/generators/mod_suexec.c:100

AH01233: File does not exist: %s", r->filename

./modules/generators/mod_asis.c:47

AH01234: file permissions deny server access: %s", r->filename

./modules/generators/mod_asis.c:54

AH01235: mod_asis: failed to find end-of-headers position "for %s", r->filename

./modules/generators/mod_asis.c:88

AH01236: mod_asis: ap_pass_brigade failed for file %s", r->filename

./modules/generators/mod_asis.c:102

AH01237: Server status unavailable in inetd mode"

./modules/generators/mod_status.c:248

AH01238: cgid daemon failed to initialize"

./modules/generators/mod_cgid.c:293

AH01239: cgid daemon process died, restarting"

./modules/generators/mod_cgid.c:297

AH01240: Couldn't unlink unix domain socket %s"

./modules/generators/mod_cgid.c:322

AH01241: "%s", description

./modules/generators/mod_cgid.c:591

AH01242: Couldn't create unix domain socket"

./modules/generators/mod_cgid.c:617

AH01243: Couldn't bind unix domain socket %s"

./modules/generators/mod_cgid.c:626

AH01244: Couldn't set permissions on unix domain socket %s"

./modules/generators/mod_cgid.c:635

AH01245: Couldn't listen on unix domain socket"

./modules/generators/mod_cgid.c:642

AH01246: Couldn't change owner of unix domain socket %s"

./modules/generators/mod_cgid.c:649

AH01247: Error accepting on cgid socket"

./modules/generators/mod_cgid.c:696

AH01248: Error reading request on cgid socket"

./modules/generators/mod_cgid.c:708

AH01249: CGI request received from wrong server instance; "see ScriptSock directive"

./modules/generators/mod_cgid.c:715

AH01250: Error writing pid %" APR_PID_T_FMT " to handler", pid

./modules/generators/mod_cgid.c:730

AH01251: couldn't set child process attributes: %s", r->filename

./modules/generators/mod_cgid.c:789

AH01252: couldn't create child process: %d: %s", rc

./modules/generators/mod_cgid.c:827

AH01253: mod_cgid: Couldn't spawn cgid daemon process"

./modules/generators/mod_cgid.c:868

AH01254: The length of the ScriptSock path exceeds maximum, "truncating to %s", tmp_sockname

./modules/generators/mod_cgid.c:928

AH01255: "unable to create socket to cgi daemon"

./modules/generators/mod_cgid.c:1194

AH01256: connect #%d to cgi daemon failed, sleeping before retry"

./modules/generators/mod_cgid.c:1198

AH01257: unable to connect to cgi daemon after multiple tries"

./modules/generators/mod_cgid.c:1209

AH01258: cgid daemon is gone; is Apache terminating?"

./modules/generators/mod_cgid.c:1220

AH01259: CGI process %" APR_PID_T_FMT " didn't exit, sending SIGKILL"

./modules/generators/mod_cgid.c:1294

AH01260: CGI process %" APR_PID_T_FMT " didn't exit, sending SIGKILL again"

./modules/generators/mod_cgid.c:1301

AH01261: daemon couldn't find CGI process for connection %lu"

./modules/generators/mod_cgid.c:1341

AH01262: Options ExecCGI is off in this directory"

./modules/generators/mod_cgid.c:1383

AH01263: attempt to include NPH CGI script"

./modules/generators/mod_cgid.c:1388

AH01264: script not found or unable to stat"

./modules/generators/mod_cgid.c:1397

AH01265: attempt to invoke directory as script"

./modules/generators/mod_cgid.c:1402

AH01266: AcceptPathInfo off disallows user's path"

./modules/generators/mod_cgid.c:1410

AH01267: file permissions deny server execution"

./modules/generators/mod_cgid.c:1416

AH01268: write to cgi daemon process"

./modules/generators/mod_cgid.c:1430

AH01269: Timeout during reading request entity data"

./modules/generators/mod_cgid.c:1469

AH01270: Error reading request entity data"

./modules/generators/mod_cgid.c:1473

AH01271: "exec used but not allowed "in %s", r->filename

./modules/generators/mod_cgid.c:1813

AH01272: execution failure for parameter \"%s\" "to tag exec in file %s", tag, r->filename

./modules/generators/mod_cgid.c:1833

AH01273: "invalid CGI ref "\"%s\" in %s", tag_val, file

./modules/generators/mod_cgid.c:1848

AH01274: "unknown parameter "\"%s\" to tag exec in %s", tag, file

./modules/generators/mod_cgid.c:1855

AH01275: Can't open directory for index: %s", r->filename

./modules/generators/mod_autoindex.c:2026

AH01276: Cannot serve directory %s: No matching DirectoryIndex (%s) found, and "server-generated directory index forbidden by "Options directive"

./modules/generators/mod_autoindex.c:2313

AH01277: LDAP: Unable to add rebind cross reference entry. Out of memory?"

./modules/ldap/util_ldap.c:325

AH01278: LDAP: Setting referrals to %s."

./modules/ldap/util_ldap.c:369

AH01279: Unable to set LDAP_OPT_REFERRALS option to %s: %d."

./modules/ldap/util_ldap.c:378

AH01280: Setting referral hop limit to %d."

./modules/ldap/util_ldap.c:390

AH01281: Unable to set LDAP_OPT_REFHOPLIMIT option to %d: %d."

./modules/ldap/util_ldap.c:398

AH01282: LDAP: Could not set the connection timeout"

./modules/ldap/util_ldap.c:445

AH01283: LDAP: Could not set LDAP_OPT_TIMEOUT"

./modules/ldap/util_ldap.c:464

AH01284: ldap_simple_bind() timed out on %s "connection, dropped by firewall?"

./modules/ldap/util_ldap.c:591

AH01285: util_ldap: Failed to create memory pool"

./modules/ldap/util_ldap.c:779

AH01286: util_ldap: Failed to create memory pool"

./modules/ldap/util_ldap.c:826

AH01287: cache_compare: Cache insertion failure."

./modules/ldap/util_ldap.c:1139

AH01288: Making local copy of SGL for "group (%s)(objectClass=%s) "

./modules/ldap/util_ldap.c:1430

AH01289: no cached SGL for %s, retrieving from LDAP", dn

./modules/ldap/util_ldap.c:1456

AH01290: "no subgroups for %s"

./modules/ldap/util_ldap.c:1462

AH01291: Cache entry for %s doesn't exist", dn

./modules/ldap/util_ldap.c:1489

AH01292: util_ldap: Couldn't retrieve group entry "for %s from cache"

./modules/ldap/util_ldap.c:1496

AH01293: Copying local SGL of len %d for group %s into cache"

./modules/ldap/util_ldap.c:1517

AH01294: Copy of SGL failed to obtain shared memory, "couldn't update cache"

./modules/ldap/util_ldap.c:1529

AH01295: Found user %s in a subgroup (%s) at level %d of %d."

./modules/ldap/util_ldap.c:1562

AH01296: User %s not found in subgroup (%s) at level %d of "%d.", r->user, group, cur_subgroup_depth+1

./modules/ldap/util_ldap.c:1572

AH01297: ldap cache: Setting shared memory cache size to "%" APR_SIZE_T_FMT " bytes."

./modules/ldap/util_ldap.c:2085

AH01298: LDAP cache: Setting shared memory cache file to %s bytes."

./modules/ldap/util_ldap.c:2112

AH01299: ldap cache: Setting cache TTL to %ld microseconds."

./modules/ldap/util_ldap.c:2133

AH01300: ldap cache: Setting search cache size to %ld entries."

./modules/ldap/util_ldap.c:2157

AH01301: ldap cache: Setting operation cache TTL to %ld microseconds."

./modules/ldap/util_ldap.c:2178

AH01302: ldap cache: Setting operation cache size to %ld entries."

./modules/ldap/util_ldap.c:2202

AH01303: LDAP: SSL trusted global cert - %s (type %s)"

./modules/ldap/util_ldap.c:2333

AH01304: LDAP: Could not open SSL trusted certificate "authority file - %s"

./modules/ldap/util_ldap.c:2352

AH01305: LDAP: SSL trusted client cert - %s (type %s)"

./modules/ldap/util_ldap.c:2413

AH01306: LDAP: Could not open SSL client certificate "file - %s"

./modules/ldap/util_ldap.c:2432

AH01307: LDAP: SSL trusted mode - %s"

./modules/ldap/util_ldap.c:2460

AH01308: LDAP: SSL verify server certificate - %s"

./modules/ldap/util_ldap.c:2496

AH01309: ldap connection: Setting connection timeout to %ld seconds."

./modules/ldap/util_ldap.c:2524

AH01310: LDAP: Connection timeout option not supported by the "LDAP SDK in use."

./modules/ldap/util_ldap.c:2528

AH01311: LDAP: Setting referral chasing %s"

./modules/ldap/util_ldap.c:2543

AH01312: LDAP: Limit chased referrals to maximum of %d hops."

./modules/ldap/util_ldap.c:2586

AH01313: ldap connection: Setting op timeout to %ld seconds."

./modules/ldap/util_ldap.c:2638

AH01314: LDAP: LDAP_OPT_TIMEOUT option not supported by the "LDAP library in use. Using LDAPTimeout value as search "timeout only."

./modules/ldap/util_ldap.c:2644

AH01315: LDAP cache: could not create shared memory segment"

./modules/ldap/util_ldap.c:2882

AH01316: LDAP merging Shared Cache conf: shm=0x%pp rmm=0x%pp "for VHOST: %s", st->cache_shm, st->cache_rmm

./modules/ldap/util_ldap.c:2905

AH01317: LDAP cache: LDAPSharedCacheSize is zero, disabling "shared memory cache"

./modules/ldap/util_ldap.c:2915

AH01318: "%s", result->reason

./modules/ldap/util_ldap.c:2927

AH01319: LDAP: SSL support available"

./modules/ldap/util_ldap.c:2951

AH01320: LDAP: SSL support unavailable%s%s"

./modules/ldap/util_ldap.c:2956

AH01321: LDAP: Could not set the LDAP library debug level to %d:(%d) %s"

./modules/ldap/util_ldap.c:2980

AH01322: Failed to initialise global mutex %s in child process"

./modules/ldap/util_ldap.c:3001

AH01323: Purge of LDAP cache failed"

./modules/ldap/util_ldap_cache_mgr.c:464

AH01324: LDAPSharedCacheSize is too small. Increase it or "reduce LDAPCacheEntries/LDAPOpCacheEntries!"

./modules/ldap/util_ldap_cache_mgr.c:477

AH01325: Could not allocate memory for LDAP cache entry"

./modules/ldap/util_ldap_cache_mgr.c:492

AH01326: LDAPSharedCacheSize is too small. Increase it or "reduce LDAPCacheEntries/LDAPOpCacheEntries!"

./modules/ldap/util_ldap_cache_mgr.c:505

AH01327: Could not allocate memory for LDAP cache value"

./modules/ldap/util_ldap_cache_mgr.c:519

AH01328: "Line too long, URI %s"

./modules/filters/mod_substitute.c:534

AH01329: regex capture $%" APR_SIZE_T_FMT " refers to no regex in %s"

./modules/filters/mod_include.c:662

AH01330: regex capture $%" APR_SIZE_T_FMT is out of range (last regex was: '%s') in %s"

./modules/filters/mod_include.c:668

AH01331: "Missing '}' on "variable \"%s\" in %s", p, r->filename

./modules/filters/mod_include.c:831

AH01332: Invalid expression \"%s\" in file %s"

./modules/filters/mod_include.c:1385

AH01333: Invalid expression \"%s\" in file %s"

./modules/filters/mod_include.c:1450

AH01334: Invalid expression \"%s\" in file %s"

./modules/filters/mod_include.c:1485

AH01335: Invalid expression \"%s\" in file %s: Token '-A' must be followed by a URI string."

./modules/filters/mod_include.c:1533

AH01336: mod_include: The tested "subrequest -A \"%s\" returned an error code."

./modules/filters/mod_include.c:1549

AH01337: Could not parse expr \"%s\" in %s: %s", expr

./modules/filters/mod_include.c:1599

AH01338: Could not evaluate expr \"%s\" in %s: %s", expr

./modules/filters/mod_include.c:1635

AH01339: "unable to get "information about \"%s\" in parsed file %s"

./modules/filters/mod_include.c:1746

AH01340: "unknown parameter \"%s\" "to tag %s in %s", tag, directive, r->filename

./modules/filters/mod_include.c:1754

AH01341: missing argument for include element in %s"

./modules/filters/mod_include.c:1779

AH01342: "unknown parameter "\"%s\" to tag include in %s", tag, r->filename

./modules/filters/mod_include.c:1808

AH01343: missing argument for echo element in %s"

./modules/filters/mod_include.c:1910

AH01344: "unknown value "\"%s\" to parameter \"decoding\" of tag echo in "%s", token, r->filename

./modules/filters/mod_include.c:1974

AH01345: "unknown value "\"%s\" to parameter \"encoding\" of tag echo in "%s", token, r->filename

./modules/filters/mod_include.c:2006

AH01346: "unknown parameter "\"%s\" in tag echo of %s", tag, r->filename

./modules/filters/mod_include.c:2038

AH01347: missing argument for config element in %s"

./modules/filters/mod_include.c:2062

AH01348: "unknown value "\"%s\" to parameter \"sizefmt\" of tag config "in %s", parsed_string, r->filename

./modules/filters/mod_include.c:2120

AH01349: "unknown parameter "\"%s\" to tag config in %s", tag, r->filename

./modules/filters/mod_include.c:2128

AH01350: missing argument for fsize element in %s"

./modules/filters/mod_include.c:2150

AH01351: missing argument for flastmod element in %s"

./modules/filters/mod_include.c:2238

AH01352: "too many arguments for if element in %s"

./modules/filters/mod_include.c:2302

AH01353: "missing expr argument for if element in %s"

./modules/filters/mod_include.c:2303

AH01354: "unknown parameter \"%s\" "to tag if in %s", tag, r->filename

./modules/filters/mod_include.c:2320

AH01355: "missing expr value for if "element in %s", r->filename

./modules/filters/mod_include.c:2327

AH01356: "too many arguments for if element in %s"

./modules/filters/mod_include.c:2375

AH01357: "missing expr argument for if element in %s"

./modules/filters/mod_include.c:2376

AH01358: "unknown parameter \"%s\" "to tag if in %s", tag, r->filename

./modules/filters/mod_include.c:2392

AH01359: "missing expr in elif "statement: %s", r->filename

./modules/filters/mod_include.c:2399

AH01360: else directive does not take tags in %s"

./modules/filters/mod_include.c:2443

AH01361: endif directive does not take tags in %s"

./modules/filters/mod_include.c:2483

AH01362: "missing argument for set element in %s"

./modules/filters/mod_include.c:2523

AH01363: "variable must "precede value in set directive in %s"

./modules/filters/mod_include.c:2569

AH01364: "unknown value "\"%s\" to parameter \"decoding\" of tag set in "%s", token, r->filename

./modules/filters/mod_include.c:2609

AH01365: "unknown value "\"%s\" to parameter \"encoding\" of tag set in "%s", token, r->filename

./modules/filters/mod_include.c:2641

AH01366: "Invalid tag for set "directive in %s", r->filename

./modules/filters/mod_include.c:2661

AH01367: "printenv directive does not take tags in %s"

./modules/filters/mod_include.c:2687

AH01368: "missing "directive name in parsed document %s"

./modules/filters/mod_include.c:3059

AH01369: "missing "argument name for value to tag %s in %s"

./modules/filters/mod_include.c:3195

AH01370: "missing "argument name for value to tag %s in %s"

./modules/filters/mod_include.c:3227

AH01371: unknown directive \"%s\" in parsed doc %s"

./modules/filters/mod_include.c:3703

AH01372: SSI directive was not properly finished at the end "of parsed document %s", r->filename

./modules/filters/mod_include.c:3740

AH01373: missing closing endif directive in parsed document" %s", r->filename

./modules/filters/mod_include.c:3749

AH01374: mod_include: Options +Includes (or IncludesNoExec) "wasn't set, INCLUDES filter removed"

./modules/filters/mod_include.c:3820

AH01375: "%s", fname

./modules/filters/mod_filter.c:86

AH01376: %s: type: %s, length: %" APR_SIZE_T_FMT

./modules/filters/mod_filter.c:91

AH01377: Chaining of FilterProviders not supported"

./modules/filters/mod_filter.c:110

AH01378: filter_init for %s failed", p->frec->name

./modules/filters/mod_filter.c:117

AH01379: Error evaluating filter dispatch condition: %s"

./modules/filters/mod_filter.c:153

AH01380: Unknown filter %s not added", p->fname

./modules/filters/mod_filter.c:643

AH01382: Request %s read timeout", ccfg->type

./modules/filters/mod_reqtimeout.c:313

AH01383: unable to init Zlib: "deflateInit2 returned %d: URL %s"

./modules/filters/mod_deflate.c:638

AH01384: Zlib: Compressed %ld to %ld : URL %s"

./modules/filters/mod_deflate.c:739

AH01385: Zlib error %d flushing zlib output buffer (%s)"

./modules/filters/mod_deflate.c:791

AH01386: Zlib error %d deflating data (%s)", zRC

./modules/filters/mod_deflate.c:850

AH01387: "Zlib: Invalid header"

./modules/filters/mod_deflate.c:936

AH01388: Zlib: Unsupported flags %02x", (int)deflate_hdr[3]

./modules/filters/mod_deflate.c:942

AH01389: unable to init Zlib: "inflateInit2 returned %d: URL %s"

./modules/filters/mod_deflate.c:952

AH01390: Encountered EOS bucket in inflate filter (bug?)"

./modules/filters/mod_deflate.c:986

AH01391: Zlib error %d inflating data (%s)", zRC

./modules/filters/mod_deflate.c:996

AH01392: Zlib error %d inflating data (%s)", zRC

./modules/filters/mod_deflate.c:1047

AH01393: Zlib: Inflated %ld to %ld : URL %s"

./modules/filters/mod_deflate.c:1056

AH01394: Zlib: CRC error inflating data"

./modules/filters/mod_deflate.c:1075

AH01395: Zlib: Length %ld of inflated data does "not match expected value %ld"

./modules/filters/mod_deflate.c:1083

AH01396: Verification data not available (bug?)"

./modules/filters/mod_deflate.c:1094

AH01397: unable to init Zlib: "inflateInit2 returned %d: URL %s"

./modules/filters/mod_deflate.c:1205

AH01398: Zlib: Inflated %ld to %ld : URL %s"

./modules/filters/mod_deflate.c:1259

AH01399: Zlib: Checksum of inflated stream invalid"

./modules/filters/mod_deflate.c:1267

AH01400: Zlib: Length of inflated stream invalid"

./modules/filters/mod_deflate.c:1274

AH01401: Zlib: Validation bytes not present"

./modules/filters/mod_deflate.c:1280

AH01402: Zlib error %d flushing inflate buffer (%s)"

./modules/filters/mod_deflate.c:1307

AH01403: Insufficient data for inflate"

./modules/filters/mod_deflate.c:1339

AH01404: inflate: data not deflated!"

./modules/filters/mod_deflate.c:1347

AH01405: inflate: bad header"

./modules/filters/mod_deflate.c:1355

AH01406: inflate: extra field too big (not "supported)"

./modules/filters/mod_deflate.c:1367

AH01407: Zlib: %d bytes of garbage at the end of "compressed stream.", ctx->stream.avail_in

./modules/filters/mod_deflate.c:1405

AH01408: Zlib: %d bytes of garbage at the end of "compressed stream."

./modules/filters/mod_deflate.c:1449

AH01409: Zlib error %d inflating data (%s)", zRC

./modules/filters/mod_deflate.c:1463

AH01410: reflector_handler: ap_pass_brigade returned %i"

./modules/filters/mod_reflector.c:160

AH01411: Invalid Content-Length"

./modules/filters/mod_request.c:101

AH01412: Requested content-length of %" APR_OFF_T_FMT is larger than the configured limit" of %" APR_OFF_T_FMT, ctx->remaining, dconf->keep_body

./modules/filters/mod_request.c:112

AH01413: Requested content-length of %" APR_OFF_T_FMT is larger than the configured limit" of %" APR_OFF_T_FMT, len, ctx->keep_body

./modules/filters/mod_request.c:139

AH01414: apr_brigade_partition() failed on kept_body at %" APR_OFF_T_FMT, ctx->offset

./modules/filters/mod_request.c:236

AH01415: apr_brigade_partition() failed on kept_body at %" APR_OFF_T_FMT, ctx->offset + readbytes

./modules/filters/mod_request.c:241

AH01416: Bogus HTML element %s dropped", name

./modules/filters/mod_proxy_html.c:388

AH01417: Deprecated HTML element %s dropped", name

./modules/filters/mod_proxy_html.c:393

AH01418: Bogus HTML attribute %s of %s dropped"

./modules/filters/mod_proxy_html.c:417

AH01419: Deprecated HTML attribute %s of %s dropped"

./modules/filters/mod_proxy_html.c:422

AH01420: HTML element %s is missing %d required attributes"

./modules/filters/mod_proxy_html.c:639

AH01421: Error evaluating expr: %s", err

./modules/filters/mod_proxy_html.c:756

AH01422: No i18n support found. Install mod_xml2enc if required"

./modules/filters/mod_proxy_html.c:890

AH01423: Unsupported parser opts %x", xmlopts

./modules/filters/mod_proxy_html.c:927

AH01424: Error in bucket read"

./modules/filters/mod_proxy_html.c:945

AH01425: I18n support in mod_proxy_html requires mod_xml2enc. "Without it, non-ASCII characters in proxied pages are "likely to display incorrectly."

./modules/filters/mod_proxy_html.c:1236

AH01426: xml2enc: bad mode %x", mode

./modules/filters/mod_xml2enc.c:104

AH01427: xml2enc: Charset %s not supported.", enc) ;

./modules/filters/mod_xml2enc.c:118

AH01428: Skipped to first <%s> element"

./modules/filters/mod_xml2enc.c:151

AH01429: Failed to find start of recognised HTML!"

./modules/filters/mod_xml2enc.c:160

AH01430: Content-Type is %s", ctype) ;

./modules/filters/mod_xml2enc.c:177

AH01431: Got charset %s from HTTP headers", ctx->encoding) ;

./modules/filters/mod_xml2enc.c:185

AH01432: Got charset from XML rules.") ;

./modules/filters/mod_xml2enc.c:197

AH01433: Got charset %s from HTML META", ctx->encoding) ;

./modules/filters/mod_xml2enc.c:222

AH01434: Charset %s not supported by libxml2; trying apr_xlate"

./modules/filters/mod_xml2enc.c:252

AH01435: Charset %s not supported. Consider aliasing it?"

./modules/filters/mod_xml2enc.c:259

AH01436: No usable charset information; using configuration default"

./modules/filters/mod_xml2enc.c:267

AH01437: xml2enc: Setting aside %" APR_SIZE_T_FMT unconverted bytes", bytes

./modules/filters/mod_xml2enc.c:420

AH01438: xml2enc: consuming %" APR_SIZE_T_FMT bytes flattened", bytes

./modules/filters/mod_xml2enc.c:437

AH01439: xml2enc: consuming %" APR_SIZE_T_FMT bytes from bucket", bytes

./modules/filters/mod_xml2enc.c:446

AH01440: xml2enc: reinserting %" APR_SIZE_T_FMT unconsumed bytes from bucket", insz

./modules/filters/mod_xml2enc.c:464

AH01441: xml2enc: converted %" APR_SIZE_T_FMT/%" APR_OFF_T_FMT " bytes", consumed - insz

./modules/filters/mod_xml2enc.c:472

AH01442: ap_fwrite failed"

./modules/filters/mod_xml2enc.c:480

AH01443: INCOMPLETE"

./modules/filters/mod_xml2enc.c:488

AH01444: Skipping invalid byte(s) in input stream!"

./modules/filters/mod_xml2enc.c:495

AH01445: Failed to convert input; trying it raw") ;

./modules/filters/mod_xml2enc.c:503

AH01446: ap_fflush failed"

./modules/filters/mod_xml2enc.c:508

AH01447: xml2enc: error reading data") ;

./modules/filters/mod_xml2enc.c:515

AH01448: incomplete configuration: src %s, dst %s"

./modules/filters/mod_charset_lite.c:216

AH01449: can't open translation %s->%s"

./modules/filters/mod_charset_lite.c:274

AH01451: %s %s - disabling "translation %s%s%s; existing "translation %s%s%s"

./modules/filters/mod_charset_lite.c:584

AH01452: chk_filter_chain() - can't disable "translation %s%s%s; existing "translation %s%s%s"

./modules/filters/mod_charset_lite.c:602

AH01453: can't open translation %s->%s"

./modules/filters/mod_charset_lite.c:813

AH01454: "rl: conn aborted"

./modules/filters/mod_ratelimit.c:69

AH01455: rl: full speed brigade pass failed."

./modules/filters/mod_ratelimit.c:149

AH01456: rl: partition failed."

./modules/filters/mod_ratelimit.c:190

AH01457: rl: brigade pass failed."

./modules/filters/mod_ratelimit.c:221

AH01458: couldn't create child process to run `%s'"

./modules/filters/mod_ext_filter.c:480

AH01459: couldn't find definition of filter '%s'"

./modules/filters/mod_ext_filter.c:568

AH01460: apr_file_read(child output), len %" APR_SIZE_T_FMT

./modules/filters/mod_ext_filter.c:658

AH01461: apr_file_write(child input), len %" APR_SIZE_T_FMT

./modules/filters/mod_ext_filter.c:689

AH01462: apr_pollset_poll()"

./modules/filters/mod_ext_filter.c:708

AH01463: "apr_bucket_read()"

./modules/filters/mod_ext_filter.c:763

AH01464: apr_file_close(child input)"

./modules/filters/mod_ext_filter.c:784

AH01465: apr_file_pipe_timeout_set(child output)"

./modules/filters/mod_ext_filter.c:794

AH01466: apr_file_read(child output), len %" APR_SIZE_T_FMT

./modules/filters/mod_ext_filter.c:806

AH01467: can't initialise output filter %s: %s"

./modules/filters/mod_ext_filter.c:844

AH01468: ef_unified_filter() failed"

./modules/filters/mod_ext_filter.c:876

AH01469: ap_pass_brigade() failed"

./modules/filters/mod_ext_filter.c:881

AH01470: can't initialise input filter %s: %s"

./modules/filters/mod_ext_filter.c:897

AH01471: "Lua error: %s"

./modules/lua/mod_lua.c:63

AH01472: "handling [%s] in mod_lua"

./modules/lua/mod_lua.c:93

AH01473: request details scope:%u, filename:%s, function:%s"

./modules/lua/mod_lua.c:112

AH01474: "got a vm!"

./modules/lua/mod_lua.c:147

AH01475: lua: Unable to find function %s in %s",handle"

./modules/lua/mod_lua.c:150

AH01476: request details scope:%u, filename:%s, function:%s"

./modules/lua/mod_lua.c:208

AH01477: lua: Failed to obtain lua interpreter for %s %s"

./modules/lua/mod_lua.c:237

AH01478: lua: Unable to find function %s in %s"

./modules/lua/mod_lua.c:246

AH01479: "FOO!"

./modules/lua/lua_config.c:161

AH01480: Failed to init LuaJIT: %s", msg

./modules/lua/lua_vmprep.c:311

AH01481: loading lua file %s", spec->file

./modules/lua/lua_vmprep.c:356

AH01482: Loading lua file %s: %s"

./modules/lua/lua_vmprep.c:375

AH01483: creating lua_State with file %s", spec->file

./modules/lua/lua_vmprep.c:406

AH01484: "Lua Stack Dump: [%s]", msg

./modules/lua/lua_request.c:33

AH01485: "adding output filter %s"

./modules/lua/lua_request.c:197

AH01486: request_rec->dispatching %s -> apr table"

./modules/lua/lua_request.c:386

AH01487: request_rec->dispatching %s -> lua_CFunction"

./modules/lua/lua_request.c:396

AH01488: request_rec->dispatching %s -> string", name

./modules/lua/lua_request.c:405

AH01489: request_rec->dispatching %s -> int", name

./modules/lua/lua_request.c:414

AH01490: request_rec->dispatching %s -> boolean", name

./modules/lua/lua_request.c:423

AH01491: "nothing for %s", name

./modules/lua/lua_request.c:432

AH01492: rfc1413: apr_sockaddr_info_get(%s) failed"

./modules/metadata/mod_ident.c:98

AH01493: rfc1413: apr_sockaddr_info_get(%s) failed"

./modules/metadata/mod_ident.c:109

AH01494: rfc1413: error creating query socket"

./modules/metadata/mod_ident.c:118

AH01495: rfc1413: error setting query socket timeout"

./modules/metadata/mod_ident.c:124

AH01496: rfc1413: Error binding query socket to local port"

./modules/metadata/mod_ident.c:140

AH01497: write: rfc1413: error sending request"

./modules/metadata/mod_ident.c:184

AH01498: read: rfc1413: error reading response"

./modules/metadata/mod_ident.c:210

AH01499: Failed to extract cookie value (out of mem?)"

./modules/metadata/mod_usertrack.c:240

AH01500: internal error: bad expires code: %s", r->filename

./modules/metadata/mod_expires.c:426

AH01501: Failed to evaluate expression (%s) - ignoring"

./modules/metadata/mod_headers.c:663

AH01502: headers: ap_headers_output_filter()"

./modules/metadata/mod_headers.c:800

AH01503: headers: ap_headers_error_filter()"

./modules/metadata/mod_headers.c:825

AH01504: Regular expression replacement failed (replacement too long?)"

./modules/metadata/mod_headers.c:879

AH01505: Regular expression replacement "failed for '%s', value too long?"

./modules/metadata/mod_setenvif.c:611

AH01506: PassEnv variable %s was undefined", arg

./modules/metadata/mod_env.c:104

AH01507:

./modules/metadata/mod_mime_magic.c:551

AH01508:

./modules/metadata/mod_mime_magic.c:653

AH01509:

./modules/metadata/mod_mime_magic.c:726

AH01510:

./modules/metadata/mod_mime_magic.c:770

AH01511:

./modules/metadata/mod_mime_magic.c:806

AH01512:

./modules/metadata/mod_mime_magic.c:845

AH01513:

./modules/metadata/mod_mime_magic.c:856

AH01514:

./modules/metadata/mod_mime_magic.c:930

AH01515:

./modules/metadata/mod_mime_magic.c:936

AH01516:

./modules/metadata/mod_mime_magic.c:986

AH01517:

./modules/metadata/mod_mime_magic.c:993

AH01518:

./modules/metadata/mod_mime_magic.c:1000

AH01519:

./modules/metadata/mod_mime_magic.c:1007

AH01520:

./modules/metadata/mod_mime_magic.c:1054

AH01521:

./modules/metadata/mod_mime_magic.c:1102

AH01522:

./modules/metadata/mod_mime_magic.c:1125

AH01523:

./modules/metadata/mod_mime_magic.c:1142

AH01524:

./modules/metadata/mod_mime_magic.c:1216

AH01525:

./modules/metadata/mod_mime_magic.c:1278

AH01526:

./modules/metadata/mod_mime_magic.c:1321

AH01527:

./modules/metadata/mod_mime_magic.c:1467

AH01528:

./modules/metadata/mod_mime_magic.c:1476

AH01529:

./modules/metadata/mod_mime_magic.c:1543

AH01530:

./modules/metadata/mod_mime_magic.c:1558

AH01531:

./modules/metadata/mod_mime_magic.c:1573

AH01532:

./modules/metadata/mod_mime_magic.c:1593

AH01533:

./modules/metadata/mod_mime_magic.c:1612

AH01534:

./modules/metadata/mod_mime_magic.c:1636

AH01535:

./modules/metadata/mod_mime_magic.c:1680

AH01536:

./modules/metadata/mod_mime_magic.c:1686

AH01537:

./modules/metadata/mod_mime_magic.c:1732

AH01538:

./modules/metadata/mod_mime_magic.c:1778

AH01539:

./modules/metadata/mod_mime_magic.c:1830

AH01540:

./modules/metadata/mod_mime_magic.c:1875

AH01541: %lu == *any* = 1", v

./modules/metadata/mod_mime_magic.c:1885

AH01542: %lu != %lu = %d", v, l, matched

./modules/metadata/mod_mime_magic.c:1894

AH01543: %lu == %lu = %d", v, l, matched

./modules/metadata/mod_mime_magic.c:1902

AH01544: %lu > %lu = %d", v, l, matched

./modules/metadata/mod_mime_magic.c:1911

AH01545: %ld > %ld = %d", v, l, matched

./modules/metadata/mod_mime_magic.c:1918

AH01546: %lu < %lu = %d", v, l, matched

./modules/metadata/mod_mime_magic.c:1928

AH01547: %ld < %ld = %d", v, l, matched

./modules/metadata/mod_mime_magic.c:1935

AH01548: ((%lx & %lx) == %lx) = %d", v, l, l, matched

./modules/metadata/mod_mime_magic.c:1944

AH01549: ((%lx & %lx) != %lx) = %d", v, l, l, matched

./modules/metadata/mod_mime_magic.c:1952

AH01550:

./modules/metadata/mod_mime_magic.c:1960

AH01551: couldn't setup child process: %s", r->filename

./modules/metadata/mod_mime_magic.c:2140

AH01552:

./modules/metadata/mod_mime_magic.c:2155

AH01553:

./modules/metadata/mod_mime_magic.c:2187

AH01554:

./modules/metadata/mod_mime_magic.c:2196

AH01555:

./modules/metadata/mod_mime_magic.c:2303

AH01556:

./modules/metadata/mod_mime_magic.c:2322

AH01557:

./modules/metadata/mod_mime_magic.c:2331

AH01558:

./modules/metadata/mod_mime_magic.c:2382

AH01559:

./modules/metadata/mod_mime_magic.c:2389

AH01560: malformed header in meta file: %s", r->filename

./modules/metadata/mod_cern_meta.c:234

AH01561: internal error in mod_cern_meta: %s", r->filename

./modules/metadata/mod_cern_meta.c:310

AH01562: meta file permissions deny server access: %s", metafilename

./modules/metadata/mod_cern_meta.c:345

AH01563: unable to find hostname of the server"

./modules/metadata/mod_unique_id.c:174

AH01564: unable to find IPv4 address of \"%s\"", str

./modules/metadata/mod_unique_id.c:183

AH01565: using low-order bits of IPv6 address "as if they were unique"

./modules/metadata/mod_unique_id.c:190

AH01566: "using ip addr %s"

./modules/metadata/mod_unique_id.c:200

AH01567: oh no! pids are greater than 32-bits! I'm broken!"

./modules/metadata/mod_unique_id.c:243

AH01568: RemoteIP: Header %s value of %s cannot be parsed "as a client IP"

./modules/metadata/mod_remoteip.c:301

AH01569: RemoteIP: Header %s value of %s appears to be "a private IP or nonsensical. Ignored"

./modules/metadata/mod_remoteip.c:340

AH01571: Watchdog: Failed to create parent worker thread."

./modules/core/mod_watchdog.c:480

AH01572: Spawned %d parent worker threads."

./modules/core/mod_watchdog.c:490

AH01573: Watchdog: Failed to create worker thread."

./modules/core/mod_watchdog.c:565

AH01574: "module %s is already loaded, skipping"

./modules/core/mod_so.c:187

AH01575: loaded module %s", modname

./modules/core/mod_so.c:245

AH01576: loaded file %s", filename

./modules/core/mod_so.c:327

AH01577: WARNING: LoadFile not supported on this platform"

./modules/core/mod_so.c:394

AH01578: WARNING: LoadModule not supported on this platform"

./modules/core/mod_so.c:402

AH01579: Custom error page caused AP_FILTER_ERROR"

./modules/http/http_request.c:102

AH01580: Invalid error redirection directive: %s"

./modules/http/http_request.c:211

AH01581: Timeout while writing data for URI %s to the" client", r->unparsed_uri

./modules/http/http_request.c:379

AH01582: dropping filter '%s' in internal redirect from %s to %s"

./modules/http/http_request.c:503

AH01583: Range: %s | %s (%d : %d : %"APR_OFF_T_FMT")"

./modules/http/byterange_filter.c:308

AH01584: copy_brigade_range() failed [%" APR_OFF_T_FMT-%" APR_OFF_T_FMT ",%" APR_OFF_T_FMT "]"

./modules/http/byterange_filter.c:554

AH01585: Unknown Transfer-Encoding: %s", tenc

./modules/http/http_filters.c:270

AH01586: Unknown Transfer-Encoding: %s; using Content-Length", tenc

./modules/http/http_filters.c:275

AH01587: Invalid Content-Length"

./modules/http/http_filters.c:292

AH01588: Requested content-length of %" APR_OFF_T_FMT is larger than the configured limit" of %" APR_OFF_T_FMT, ctx->remaining, ctx->limit

./modules/http/http_filters.c:302

AH01589: "Error reading first chunk %s "

./modules/http/http_filters.c:395

AH01590: "Error reading chunk %s "

./modules/http/http_filters.c:501

AH01591: Read content-length of %" APR_OFF_T_FMT is larger than the configured limit" of %" APR_OFF_T_FMT, ctx->limit_used, ctx->limit

./modules/http/http_filters.c:570

AH01592: Unknown Transfer-Encoding %s", tenc

./modules/http/http_filters.c:1474

AH01593: chunked Transfer-Encoding forbidden: %s", r->uri

./modules/http/http_filters.c:1479

AH01594: Invalid Content-Length"

./modules/http/http_filters.c:1492

AH01595: %s with body is not allowed for %s", r->method, r->uri

./modules/http/http_filters.c:1500

AH01596: Invalid mime types config path %s"

./modules/http/mod_mime.c:443

AH01597: could not open mime types config file %s."

./modules/http/mod_mime.c:451

AH01598: mod_mime: analyze_ct: cannot get media type from '%s'"

./modules/http/mod_mime.c:565

AH01599: Cannot get media type from '%s'"

./modules/http/mod_mime.c:575

AH01600: mod_mime: analyze_ct: cannot get media type from '%s'"

./modules/http/mod_mime.c:584

AH01601: Cannot get media subtype."

./modules/http/mod_mime.c:598

AH01602: Cannot get media parameter."

./modules/http/mod_mime.c:619

AH01603: Cannot get media parameter."

./modules/http/mod_mime.c:640

AH01604: Cannot get media parameter."

./modules/http/mod_mime.c:647

AH01605: Cannot get media parameter."

./modules/http/mod_mime.c:655

AH01606: Cannot get media parameter."

./modules/http/mod_mime.c:684

AH01607: Cannot get media parameter."

./modules/http/mod_mime.c:691

AH01608: Cannot get media parameter."

./modules/http/mod_mime.c:706

AH01609: Cannot get media parameter."

./modules/http/mod_mime.c:714

AH01610: Maximum new request methods %d reached while "registering method %s."

./modules/http/http_protocol.c:500

AH01611: ProtocolEcho: Failure reading from %s"

./modules/echo/mod_echo.c:155

AH01612: ProtocolEcho: Error - read empty brigade from %s!"

./modules/echo/mod_echo.c:164

AH01613: ProtocolEcho: Failure writing to %s"

./modules/echo/mod_echo.c:182

AH01614: client used wrong authentication scheme: %s", r->uri

./modules/aaa/mod_auth_basic.c:158

AH01615: "need AuthName: %s", r->uri

./modules/aaa/mod_auth_basic.c:204

AH01616: No Authn provider configured"

./modules/aaa/mod_auth_basic.c:228

AH01617: user %s: authentication failure for \"%s\": "Password Mismatch"

./modules/aaa/mod_auth_basic.c:268

AH01618: user %s not found: %s", sent_user, r->uri

./modules/aaa/mod_auth_basic.c:275

AH01619: AuthUserFile not specified in the configuration"

./modules/aaa/mod_authn_file.c:79

AH01620: Could not open password file: %s", conf->pwfile

./modules/aaa/mod_authn_file.c:87

AH01621: AuthUserFile not specified in the configuration"

./modules/aaa/mod_authn_file.c:134

AH01622: Could not open password file: %s", conf->pwfile

./modules/aaa/mod_authn_file.c:142

AH01623: client method denied by server configuration: '%s' to %s%s"

./modules/aaa/mod_allowmethods.c:70

AH01624: %s"

./modules/aaa/mod_authz_core.c:609

AH01625: authorization result of %s: %s "(directive limited to other methods)"

./modules/aaa/mod_authz_core.c:698

AH01626: authorization result of %s: %s"

./modules/aaa/mod_authz_core.c:780

AH01627: AuthType configured with no corresponding "authorization directives"

./modules/aaa/mod_authz_core.c:801

AH01628: authorization result: granted (no directives)"

./modules/aaa/mod_authz_core.c:808

AH01629: authorization failure (no authenticated user): %s"

./modules/aaa/mod_authz_core.c:821

AH01630: client denied by server configuration: %s%s"

./modules/aaa/mod_authz_core.c:844

AH01631: user %s: authorization failure for \"%s\": "

./modules/aaa/mod_authz_core.c:852

AH01632: Authorization of user %s to access %s failed, reason: %s"

./modules/aaa/mod_authz_owner.c:50

AH01633: Authorization of user %s to access %s failed, reason: %s"

./modules/aaa/mod_authz_owner.c:64

AH01634: Authorization of user %s to access %s failed, reason: %s"

./modules/aaa/mod_authz_owner.c:74

AH01635: Authorization of user %s to access %s failed, reason: %s"

./modules/aaa/mod_authz_owner.c:82

AH01636: Authorization of user %s to access %s failed, reason: %s"

./modules/aaa/mod_authz_owner.c:91

AH01637: Authorization of user %s to access %s failed, reason: %s"

./modules/aaa/mod_authz_owner.c:100

AH01638: Authorization of user %s to access %s failed, reason: %s"

./modules/aaa/mod_authz_owner.c:129

AH01639: Authorization of user %s to access %s failed, reason: %s"

./modules/aaa/mod_authz_owner.c:139

AH01640: Authorization of user %s to access %s failed, reason: %s"

./modules/aaa/mod_authz_owner.c:147

AH01641: Authorization of user %s to access %s failed, reason: %s"

./modules/aaa/mod_authz_owner.c:156

AH01642: No query configured for %s!", action

./modules/aaa/mod_authz_dbd.c:125

AH01643: Error retrieving Query for %s!", action

./modules/aaa/mod_authz_dbd.c:131

AH01644: authz_dbd: %s of user %s updated %d rows"

./modules/aaa/mod_authz_dbd.c:140

AH01645: authz_dbd: query for %s failed; user %s [%s]"

./modules/aaa/mod_authz_dbd.c:147

AH01646: authz_dbd: no redirect query!"

./modules/aaa/mod_authz_dbd.c:161

AH01647: authz_dbd in get_row; action=%s user=%s [%s]"

./modules/aaa/mod_authz_dbd.c:172

AH01648: authz_dbd/redirect for %s of %s [%s]"

./modules/aaa/mod_authz_dbd.c:184

AH01649: No query configured for dbd-group!"

./modules/aaa/mod_authz_dbd.c:210

AH01650: Error retrieving query for dbd-group!"

./modules/aaa/mod_authz_dbd.c:216

AH01651: authz_dbd in get_row; group query for user=%s [%s]"

./modules/aaa/mod_authz_dbd.c:232

AH01652: authz_dbd, in groups query for %s [%s]"

./modules/aaa/mod_authz_dbd.c:241

AH01653: Failed to acquire database connection to look up "user '%s'", user

./modules/aaa/mod_authn_dbd.c:108

AH01654: No AuthDBDUserPWQuery has been specified"

./modules/aaa/mod_authn_dbd.c:115

AH01655: A prepared statement could not be found for "AuthDBDUserPWQuery with the key '%s'", conf->user

./modules/aaa/mod_authn_dbd.c:122

AH01656: Query execution error looking up '%s' "in database", user

./modules/aaa/mod_authn_dbd.c:129

AH01657: Error retrieving results while looking up '%s' "in database", user

./modules/aaa/mod_authn_dbd.c:138

AH01658: Failed to acquire database connection to look up "user '%s:%s'", user, realm

./modules/aaa/mod_authn_dbd.c:201

AH01659: No AuthDBDUserRealmQuery has been specified"

./modules/aaa/mod_authn_dbd.c:207

AH01660: A prepared statement could not be found for "AuthDBDUserRealmQuery with the key '%s'", conf->realm

./modules/aaa/mod_authn_dbd.c:213

AH01661: Query execution error looking up '%s:%s' "in database", user, realm

./modules/aaa/mod_authn_dbd.c:220

AH01662: Error retrieving results while looking up '%s:%s' "in database", user, realm

./modules/aaa/mod_authn_dbd.c:229

AH01663: access to %s failed, reason: user '%s' does not meet "'require'ments for user to be allowed access"

./modules/aaa/mod_authz_user.c:65

AH01664: No group file was specified in the configuration"

./modules/aaa/mod_authz_groupfile.c:164

AH01665: Could not open group file: %s"

./modules/aaa/mod_authz_groupfile.c:173

AH01666: Authorization of user %s to access %s failed, reason: "user doesn't appear in group file (%s)."

./modules/aaa/mod_authz_groupfile.c:181

AH01667: Authorization of user %s to access %s failed, reason: "user is not part of the 'require'ed group(s)."

./modules/aaa/mod_authz_groupfile.c:195

AH01668: No group file was specified in the configuration"

./modules/aaa/mod_authz_groupfile.c:224

AH01669: Could not open group file: %s"

./modules/aaa/mod_authz_groupfile.c:232

AH01670: Authorization of user %s to access %s failed, reason: "user doesn't appear in group file (%s)."

./modules/aaa/mod_authz_groupfile.c:240

AH01671: Authorization of user %s to access %s failed, reason: "user is not part of the 'require'ed file group."

./modules/aaa/mod_authz_groupfile.c:262

AH01672: Anonymous: Passwd <%s> Accepted"

./modules/aaa/mod_authn_anon.c:182

AH01673: failed to register %s mutex", authn_cache_id

./modules/aaa/mod_authn_socache.c:75

AH01674: Please select a socache provider with AuthnCacheSOCache "(no default found on this platform). Maybe you need to "load mod_socache_shmcb or another socache module first"

./modules/aaa/mod_authn_socache.c:96

AH01675: failed to create %s mutex", authn_cache_id

./modules/aaa/mod_authn_socache.c:106

AH01676: "%s", errmsg

./modules/aaa/mod_authn_socache.c:114

AH01677: failed to initialise %s cache", authn_cache_id

./modules/aaa/mod_authn_socache.c:121

AH01678: failed to initialise mutex in child_init"

./modules/aaa/mod_authn_socache.c:138

AH01679: authn credentials for %s not cached (mutex busy)", user

./modules/aaa/mod_authn_socache.c:290

AH01680: Failed to cache authn credentials for %s in %s"

./modules/aaa/mod_authn_socache.c:295

AH01681: Cached authn credentials for %s in %s"

./modules/aaa/mod_authn_socache.c:311

AH01682: Failed to cache authn credentials for %s in %s"

./modules/aaa/mod_authn_socache.c:316

AH01683: "Failed to release mutex!"

./modules/aaa/mod_authn_socache.c:324

AH01684: Authn cache: no credentials found for %s", user

./modules/aaa/mod_authn_socache.c:360

AH01685: Authn cache: found credentials for %s", user

./modules/aaa/mod_authn_socache.c:366

AH01686: Error accessing authentication cache"

./modules/aaa/mod_authn_socache.c:373

AH01687: Authn cache: no credentials found for %s", user

./modules/aaa/mod_authn_socache.c:405

AH01688: Authn cache: found credentials for %s", user

./modules/aaa/mod_authn_socache.c:411

AH01689: Error accessing authentication cache"

./modules/aaa/mod_authn_socache.c:417

AH01690: auth_ldap authenticate: no sec->host - weird...?"

./modules/aaa/mod_authnz_ldap.c:495

AH01691: auth_ldap authenticate: using URL %s", sec->url

./modules/aaa/mod_authnz_ldap.c:500

AH01692: auth_ldap authenticate: no password specified"

./modules/aaa/mod_authnz_ldap.c:505

AH01693: auth_ldap authenticate: no user specified"

./modules/aaa/mod_authnz_ldap.c:512

AH01694: auth_ldap authenticate: user %s authentication failed; "URI %s [%s][%s] (not authoritative)"

./modules/aaa/mod_authnz_ldap.c:536

AH01695: auth_ldap authenticate: "user %s authentication failed; URI %s [%s][%s]"

./modules/aaa/mod_authnz_ldap.c:543

AH01696: auth_ldap authenticate: "REMOTE_USER was to be set with attribute '%s', "but this attribute was not requested for in the "LDAP query for the user. REMOTE_USER will fall "back to username or DN as appropriate."

./modules/aaa/mod_authnz_ldap.c:583

AH01697: auth_ldap authenticate: accepting %s", user

./modules/aaa/mod_authnz_ldap.c:592

AH01698: auth_ldap authorize: no sec->host - weird...?"

./modules/aaa/mod_authnz_ldap.c:631

AH01699: ldap authorize: Userid is blank, AuthType=%s"

./modules/aaa/mod_authnz_ldap.c:644

AH01700: ldap authorize: Creating LDAP req structure"

./modules/aaa/mod_authnz_ldap.c:650

AH01701: auth_ldap authorise: User DN not found, %s", ldc->reason

./modules/aaa/mod_authnz_ldap.c:665

AH01702: auth_ldap authorize: require user: user's DN has not "been defined; failing authorization"

./modules/aaa/mod_authnz_ldap.c:677

AH01703: auth_ldap authorize: require user: authorization "successful"

./modules/aaa/mod_authnz_ldap.c:690

AH01704: auth_ldap authorize: require user: "authorization failed [%s][%s]"

./modules/aaa/mod_authnz_ldap.c:697

AH01705: auth_ldap authorize: "require user: authorization successful"

./modules/aaa/mod_authnz_ldap.c:712

AH01706: auth_ldap authorize: "require user: authorization failed [%s][%s]"

./modules/aaa/mod_authnz_ldap.c:719

AH01707: auth_ldap authorize user: authorization denied for "user %s to %s"

./modules/aaa/mod_authnz_ldap.c:727

AH01708: auth_ldap authorize: no sec->host - weird...?"

./modules/aaa/mod_authnz_ldap.c:769

AH01709: ldap authorize: Userid is blank, AuthType=%s"

./modules/aaa/mod_authnz_ldap.c:817

AH01710: ldap authorize: Creating LDAP req structure"

./modules/aaa/mod_authnz_ldap.c:823

AH01711: auth_ldap authorise: User DN not found, %s", ldc->reason

./modules/aaa/mod_authnz_ldap.c:837

AH01712: auth_ldap authorize: require group: user's DN has "not been defined; failing authorization for user %s"

./modules/aaa/mod_authnz_ldap.c:851

AH01713: auth_ldap authorize: require group: testing for group "membership in \"%s\""

./modules/aaa/mod_authnz_ldap.c:868

AH01714: auth_ldap authorize: require group: testing for %s: "%s (%s)"

./modules/aaa/mod_authnz_ldap.c:875

AH01715: auth_ldap authorize: require group: "authorization successful (attribute %s) "[%s][%d - %s]"

./modules/aaa/mod_authnz_ldap.c:884

AH01716: auth_ldap authorise: require group \"%s\": "failed [%s][%d - %s], checking sub-groups"

./modules/aaa/mod_authnz_ldap.c:912

AH01717: auth_ldap authorise: require group "(sub-group): authorisation successful "(attribute %s) [%s][%d - %s]"

./modules/aaa/mod_authnz_ldap.c:923

AH01718: auth_ldap authorise: require group "(sub-group) \"%s\": didn't match with attr %s "[%s][%d - %s]"

./modules/aaa/mod_authnz_ldap.c:933

AH01719: auth_ldap authorize: require group \"%s\": "didn't match with attr %s [%s][%d - %s]"

./modules/aaa/mod_authnz_ldap.c:894

AH01720: auth_ldap authorize group: authorization denied for "user %s to %s"

./modules/aaa/mod_authnz_ldap.c:942

AH01721: auth_ldap authorize: no sec->host - weird...?"

./modules/aaa/mod_authnz_ldap.c:982

AH01722: ldap authorize: Userid is blank, AuthType=%s"

./modules/aaa/mod_authnz_ldap.c:994

AH01723: ldap authorize: Creating LDAP req structure"

./modules/aaa/mod_authnz_ldap.c:1000

AH01724: auth_ldap authorise: User DN not found with filter %s: %s", filtbuf, ldc->reason

./modules/aaa/mod_authnz_ldap.c:1014

AH01725: auth_ldap authorize: require dn: user's DN has not "been defined; failing authorization"

./modules/aaa/mod_authnz_ldap.c:1027

AH01726: auth_ldap authorize: "require dn: authorization successful"

./modules/aaa/mod_authnz_ldap.c:1036

AH01727: auth_ldap authorize: "require dn \"%s\": LDAP error [%s][%s]"

./modules/aaa/mod_authnz_ldap.c:1043

AH01728: auth_ldap authorize dn: authorization denied for "user %s to %s"

./modules/aaa/mod_authnz_ldap.c:1051

AH01729: auth_ldap authorize: no sec->host - weird...?"

./modules/aaa/mod_authnz_ldap.c:1092

AH01730: ldap authorize: Userid is blank, AuthType=%s"

./modules/aaa/mod_authnz_ldap.c:1104

AH01731: ldap authorize: Creating LDAP req structure"

./modules/aaa/mod_authnz_ldap.c:1110

AH01732: auth_ldap authorise: User DN not found with filter %s: %s", filtbuf, ldc->reason

./modules/aaa/mod_authnz_ldap.c:1124

AH01733: auth_ldap authorize: require ldap-attribute: user's DN "has not been defined; failing authorization"

./modules/aaa/mod_authnz_ldap.c:1135

AH01734: auth_ldap authorize: checking attribute %s has value %s"

./modules/aaa/mod_authnz_ldap.c:1146

AH01735: auth_ldap authorize: "require attribute: authorization successful"

./modules/aaa/mod_authnz_ldap.c:1152

AH01736: auth_ldap authorize: require attribute: "authorization failed [%s][%s]"

./modules/aaa/mod_authnz_ldap.c:1159

AH01737: auth_ldap authorize attribute: authorization denied for "user %s to %s"

./modules/aaa/mod_authnz_ldap.c:1167

AH01738: auth_ldap authorize: no sec->host - weird...?"

./modules/aaa/mod_authnz_ldap.c:1206

AH01739: ldap authorize: Userid is blank, AuthType=%s"

./modules/aaa/mod_authnz_ldap.c:1218

AH01740: ldap authorize: Creating LDAP req structure"

./modules/aaa/mod_authnz_ldap.c:1224

AH01741: auth_ldap authorise: User DN not found with filter %s: %s", filtbuf, ldc->reason

./modules/aaa/mod_authnz_ldap.c:1238

AH01742: auth_ldap authorize: require ldap-filter: user's DN "has not been defined; failing authorization"

./modules/aaa/mod_authnz_ldap.c:1249

AH01743: auth_ldap authorize: checking filter %s", t

./modules/aaa/mod_authnz_ldap.c:1258

AH01744: auth_ldap authorize: checking dn match %s", dn

./modules/aaa/mod_authnz_ldap.c:1270

AH01745: auth_ldap authorize: require ldap-filter: "authorization successful"

./modules/aaa/mod_authnz_ldap.c:1284

AH01746: auth_ldap authorize: require ldap-filter: "%s authorization failed [%s][%s]"

./modules/aaa/mod_authnz_ldap.c:1291

AH01747: auth_ldap authorize: require ldap-filter: "authorization failed [%s][%s]"

./modules/aaa/mod_authnz_ldap.c:1298

AH01748: auth_ldap authorize filter: authorization denied for "user %s to %s"

./modules/aaa/mod_authnz_ldap.c:1306

AH01749: Module mod_ldap missing. Mod_ldap (aka. util_ldap) "must be loaded in order for mod_authnz_ldap to function properly"

./modules/aaa/mod_authnz_ldap.c:1671

AH01750: Invalid charset conversion config path %s"

./modules/aaa/mod_authnz_ldap.c:1684

AH01751: could not open charset conversion config file %s."

./modules/aaa/mod_authnz_ldap.c:1692

AH01752: could not find the UTF-8 charset in the file %s."

./modules/aaa/mod_authnz_ldap.c:1719

AH01753: access check of '%s' to %s failed, reason: unable to get the "remote host name", require_line, r->uri

./modules/aaa/mod_authz_host.c:179

AH01754: could not open dbm (type %s) auth file: %s"

./modules/aaa/mod_authn_dbm.c:131

AH01755: Could not open dbm (type %s) hash file: %s"

./modules/aaa/mod_authn_dbm.c:170

AH01756: cleaning up shared memory"

./modules/aaa/mod_auth_digest.c:203

AH01757: generating secret for digest authentication ..."

./modules/aaa/mod_auth_digest.c:233

AH01758: error generating secret: %s"

./modules/aaa/mod_auth_digest.c:244

AH01759: "done"

./modules/aaa/mod_auth_digest.c:250

AH01760: %s - all nonce-count checking, one-time nonces, and "MD5-sess algorithm disabled", msg

./modules/aaa/mod_auth_digest.c:257

AH01761: Failed to find temporary directory"

./modules/aaa/mod_auth_digest.c:276

AH01762: Failed to create shared memory segment on file %s"

./modules/aaa/mod_auth_digest.c:295

AH01763: Set shmem-size: %" APR_SIZE_T_FMT ", num-buckets: %ld"

./modules/aaa/mod_auth_digest.c:674

AH01764: get_client(): client %lu found", key

./modules/aaa/mod_auth_digest.c:788

AH01765: get_client(): client %lu not found", key

./modules/aaa/mod_auth_digest.c:792

AH01766: gc'd %ld client entries. Total new clients: "%ld; Total removed clients: %ld; Total renewed clients: "%ld", num_removed

./modules/aaa/mod_auth_digest.c:863

AH01767: unable to allocate new auth_digest client"

./modules/aaa/mod_auth_digest.c:871

AH01768: allocated new client %lu", key

./modules/aaa/mod_auth_digest.c:889

AH01769: failed to allocate client entry - ignoring client"

./modules/aaa/mod_auth_digest.c:1147

AH01770: No Authn provider configured"

./modules/aaa/mod_auth_digest.c:1419

AH01771: cannot check nonce count without shared memory"

./modules/aaa/mod_auth_digest.c:1467

AH01772: invalid nc %s received - no nonce count allowed when qop=none"

./modules/aaa/mod_auth_digest.c:1481

AH01773: invalid nc %s received - not a number", snc

./modules/aaa/mod_auth_digest.c:1492

AH01774: Warning, possible replay attack: nonce-count "check failed: %lu != %lu", nc

./modules/aaa/mod_auth_digest.c:1502

AH01775: invalid nonce %s received - length is not %d"

./modules/aaa/mod_auth_digest.c:1520

AH01776: invalid nonce %s received - hash is not %s"

./modules/aaa/mod_auth_digest.c:1535

AH01777: invalid nonce %s received - user attempted "time travel", resp->nonce

./modules/aaa/mod_auth_digest.c:1544

AH01778: user %s: nonce expired (%.2f seconds old "- max lifetime %.2f) - sending new nonce"

./modules/aaa/mod_auth_digest.c:1553

AH01779: user %s: one-time-nonce mismatch - sending "new nonce", r->user

./modules/aaa/mod_auth_digest.c:1564

AH01780: need AuthName: %s", r->uri

./modules/aaa/mod_auth_digest.c:1700

AH01781: client used wrong authentication scheme `%s': %s"

./modules/aaa/mod_auth_digest.c:1730

AH01782: missing user, realm, nonce, uri, digest, "cnonce, or nonce_count in authorization header: %s"

./modules/aaa/mod_auth_digest.c:1735

AH01783: invalid uri <%s> in Authorization header"

./modules/aaa/mod_auth_digest.c:1758

AH01784: applying AuthDigestEnableQueryStringHack "to uri <%s>", resp->raw_request_uri

./modules/aaa/mod_auth_digest.c:1793

AH01785: uri mismatch - <%s> does not match "request-uri <%s>", resp->uri, r_uri.hostinfo

./modules/aaa/mod_auth_digest.c:1803

AH01786: uri mismatch - <%s> does not match "request-uri <%s>", resp->uri, resp->raw_request_uri

./modules/aaa/mod_auth_digest.c:1831

AH01787: received invalid opaque - got `%s'"

./modules/aaa/mod_auth_digest.c:1839

AH01788: realm mismatch - got %s' but expected %s'"

./modules/aaa/mod_auth_digest.c:1847

AH01789: unknown algorithm `%s' received: %s"

./modules/aaa/mod_auth_digest.c:1857

AH01790: user %s' in realm %s' not found: %s"

./modules/aaa/mod_auth_digest.c:1867

AH01791: user %s' in realm %s' denied by provider: %s"

./modules/aaa/mod_auth_digest.c:1878

AH01792: user %s: password mismatch: %s", r->user

./modules/aaa/mod_auth_digest.c:1895

AH01793: invalid qop `%s' received: %s"

./modules/aaa/mod_auth_digest.c:1915

AH01794: user %s: password mismatch: %s", r->user

./modules/aaa/mod_auth_digest.c:1928

AH01795: internal error: couldn't find session "info for user %s", resp->username

./modules/aaa/mod_auth_digest.c:2008

AH01796: AuthType %s configured without corresponding module"

./modules/aaa/mod_authn_core.c:354

AH01797: client denied by server configuration: %s%s"

./modules/aaa/mod_access_compat.c:353

AH01798: No group file was specified in the configuration"

./modules/aaa/mod_authz_dbm.c:152

AH01799: could not open dbm (type %s) group access "file: %s", conf->dbmtype, conf->grpfile

./modules/aaa/mod_authz_dbm.c:165

AH01800: Authorization of user %s to access %s failed, reason: "user doesn't appear in DBM group file (%s)."

./modules/aaa/mod_authz_dbm.c:173

AH01801: Authorization of user %s to access %s failed, reason: "user is not part of the 'require'ed group(s)."

./modules/aaa/mod_authz_dbm.c:194

AH01802: No group file was specified in the configuration"

./modules/aaa/mod_authz_dbm.c:223

AH01803: could not open dbm (type %s) group access "file: %s", conf->dbmtype, conf->grpfile

./modules/aaa/mod_authz_dbm.c:233

AH01804: Authorization of user %s to access %s failed, reason: "user doesn't appear in DBM group file (%s)."

./modules/aaa/mod_authz_dbm.c:241

AH01805: Authorization of user %s to access %s failed, reason: "user is not part of the 'require'ed group(s)."

./modules/aaa/mod_authz_dbm.c:262

AH01806: no authn provider configured"

./modules/aaa/mod_auth_form.c:745

AH01807: user '%s': authentication failure for \"%s\": "password Mismatch"

./modules/aaa/mod_auth_form.c:789

AH01808: user '%s' not found: %s", sent_user, r->uri

./modules/aaa/mod_auth_form.c:796

AH01809: "form auth cannot be used for proxy "requests due to XSS risk, access denied: %s", r->uri

./modules/aaa/mod_auth_form.c:871

AH01810: "need AuthName: %s", r->uri

./modules/aaa/mod_auth_form.c:879

AH01811: the " FORM_LOGIN_HANDLER " only supports the POST method for %s"

./modules/aaa/mod_auth_form.c:1071

AH01812: internal redirect to method '%s' and body mimetype '%s' for the "uri: %s", sent_method, sent_mimetype, r->uri

./modules/aaa/mod_auth_form.c:1173

AH01813: internal redirect requested but one or all of method, mimetype or "body are NULL: %s", r->uri

./modules/aaa/mod_auth_form.c:1182

AH01814: excluded by configuration for: %s", r->uri

./modules/session/mod_session.c:107

AH01815: session is enabled but no session modules have been configured, "session not loaded: %s", r->uri

./modules/session/mod_session.c:115

AH01816: error while loading the session, "session not loaded: %s", r->uri

./modules/session/mod_session.c:121

AH01817: error while decoding the session, "session not loaded: %s", r->uri

./modules/session/mod_session.c:142

AH01818: attempt made to save the session twice, "session not saved: %s", r->uri

./modules/session/mod_session.c:181

AH01819: attempt made to save a session when the session had already expired, "session not saved: %s", r->uri

./modules/session/mod_session.c:187

AH01820: error while encoding the session, "session not saved: %s", r->uri

./modules/session/mod_session.c:202

AH01821: session is enabled but no session modules have been configured, "session not saved: %s", r->uri

./modules/session/mod_session.c:211

AH01822: error while saving the session, "session not saved: %s", r->uri

./modules/session/mod_session.c:217

AH01823: no ciphers returned by APR. "session encryption not possible"

./modules/session/mod_session_crypto.c:74

AH01824: cipher '%s' not recognised by crypto driver. "session encryption not possible, options: %s", dconf->cipher, options

./modules/session/mod_session_crypto.c:107

AH01825: the passphrase '%s' was empty", passphrase

./modules/session/mod_session_crypto.c:161

AH01826: padding is not supported for cipher"

./modules/session/mod_session_crypto.c:165

AH01827: the key type is not known"

./modules/session/mod_session_crypto.c:169

AH01828: encryption could not be configured."

./modules/session/mod_session_crypto.c:173

AH01829: apr_crypto_block_encrypt_init failed"

./modules/session/mod_session_crypto.c:180

AH01830: apr_crypto_block_encrypt failed"

./modules/session/mod_session_crypto.c:189

AH01831: apr_crypto_block_encrypt_finish failed"

./modules/session/mod_session_crypto.c:195

AH01832: the passphrase '%s' was empty", passphrase

./modules/session/mod_session_crypto.c:261

AH01833: padding is not supported for cipher"

./modules/session/mod_session_crypto.c:266

AH01834: the key type is not known"

./modules/session/mod_session_crypto.c:271

AH01835: encryption could not be configured."

./modules/session/mod_session_crypto.c:276

AH01836: too short to decrypt, skipping"

./modules/session/mod_session_crypto.c:283

AH01837: apr_crypto_block_decrypt_init failed"

./modules/session/mod_session_crypto.c:296

AH01838: apr_crypto_block_decrypt failed"

./modules/session/mod_session_crypto.c:309

AH01839: apr_crypto_block_decrypt_finish failed"

./modules/session/mod_session_crypto.c:317

AH01840: decryption failed"

./modules/session/mod_session_crypto.c:328

AH01841: encrypt session failed"

./modules/session/mod_session_crypto.c:355

AH01842: decrypt session failed, wrong passphrase?"

./modules/session/mod_session_crypto.c:387

AH01843: APR crypto could not be initialised"

./modules/session/mod_session_crypto.c:424

AH01844: warning: crypto for '%s' was already initialised, "using existing configuration", conf->library

./modules/session/mod_session_crypto.c:431

AH01845: %s", err->msg

./modules/session/mod_session_crypto.c:437

AH01846: The crypto library '%s' could not be found"

./modules/session/mod_session_crypto.c:442

AH01847: The crypto library '%s' could not be loaded"

./modules/session/mod_session_crypto.c:448

AH01848: The crypto library '%s' could not be initialised"

./modules/session/mod_session_crypto.c:456

AH01849: The crypto library '%s' was loaded successfully"

./modules/session/mod_session_crypto.c:462

AH01850: You must load mod_dbd to enable AuthDBD functions"

./modules/session/mod_session_dbd.c:69

AH01851: failed to acquire database connection"

./modules/session/mod_session_dbd.c:77

AH01852: failed to find the prepared statement called '%s'", query

./modules/session/mod_session_dbd.c:84

AH01853: no SessionDBDselectlabel has been specified"

./modules/session/mod_session_dbd.c:112

AH01854: query execution error saving session '%s' "in database using query '%s': %s", key, conf->selectlabel

./modules/session/mod_session_dbd.c:124

AH01855: error retrieving results while saving '%s' "in database using query '%s': %s", key, conf->selectlabel

./modules/session/mod_session_dbd.c:134

AH01856: no SessionDBDupdatelabel has been specified"

./modules/session/mod_session_dbd.c:266

AH01857: query execution error updating session '%s' "using database query '%s': %s", key, conf->updatelabel

./modules/session/mod_session_dbd.c:278

AH01858: no SessionDBDinsertlabel has been specified"

./modules/session/mod_session_dbd.c:294

AH01859: query execution error inserting session '%s' "in database with '%s': %s", key, conf->insertlabel

./modules/session/mod_session_dbd.c:306

AH01860: the session insert query did not cause any rows to be added "to the database for session '%s', session not inserted", key

./modules/session/mod_session_dbd.c:321

AH01861: failed to acquire database connection to remove "session with key '%s'", key

./modules/session/mod_session_dbd.c:343

AH01862: no SessionDBDdeletelabel has been specified"

./modules/session/mod_session_dbd.c:350

AH01863: prepared statement could not be found for "SessionDBDdeletelabel with the label '%s'"

./modules/session/mod_session_dbd.c:358

AH01864: query execution error removing session '%s' "from database", key

./modules/session/mod_session_dbd.c:367

AH01865: peruser sessions can only be saved if a user is logged in, "session not saved: %s", r->uri

./modules/session/mod_session_dbd.c:464

AH01866: "Optional hook test said: %s"

./modules/test/mod_optional_hook_import.c:24

AH01867: dialup: pulse: ap_pass_brigade failed:"

./modules/test/mod_dialup.c:89

AH01868: dialup: pulse returned: %d", status

./modules/test/mod_dialup.c:123

AH01869: dialup: declined, meets conditions, good luck core handler"

./modules/test/mod_dialup.c:180

AH01870: dialup: failed, send pulse"

./modules/test/mod_dialup.c:209

AH01871: Optional function test said: %s",szStr

./modules/test/mod_optional_fn_export.c:28

AH01872: Could not initialize stapling cache. Exiting."

./modules/ssl/ssl_scache.c:64

AH01873: Init: Session Cache is not configured "[hint: SSLSessionCache]"

./modules/ssl/ssl_scache.c:76

AH01874: Could not initialize session cache. Exiting."

./modules/ssl/ssl_scache.c:89

AH01875: session is too big (%u bytes)", len

./modules/ssl/ssl_scache.c:123

AH01876: %s compiled against Server: %s, Library: %s"

./modules/ssl/ssl_engine_init.c:54

AH01877: Init: Skipping generating temporary "%d bit RSA private key in FIPS mode", bits

./modules/ssl/ssl_engine_init.c:91

AH01878: Init: Failed to generate temporary "%d bit RSA private key", bits

./modules/ssl/ssl_engine_init.c:107

AH01879: Init: Failed to generate temporary "%d bit RSA private key", bits

./modules/ssl/ssl_engine_init.c:120

AH01880: Init: Skipping generating temporary "%d bit DH parameters in FIPS mode", bits

./modules/ssl/ssl_engine_init.c:140

AH01881: Init: Failed to generate temporary "%d bit DH parameters", bits

./modules/ssl/ssl_engine_init.c:151

AH01882: Init: this version of mod_ssl was compiled against "a newer library (%s, version currently loaded is %s)" - may result in undefined or erroneous behavior"

./modules/ssl/ssl_engine_init.c:199

AH01883: Init: Initialized %s library", SSL_LIBRARY_NAME

./modules/ssl/ssl_engine_init.c:286

AH01884: Operating in SSL FIPS mode"

./modules/ssl/ssl_engine_init.c:300

AH01885: "FIPS mode failed"

./modules/ssl/ssl_engine_init.c:304

AH01886: SSL FIPS mode disabled"

./modules/ssl/ssl_engine_init.c:311

AH01887: Init: Initializing (virtual) servers for SSL"

./modules/ssl/ssl_engine_init.c:346

AH01888: Init: Failed to load Crypto Device API `%s'"

./modules/ssl/ssl_engine_init.c:391

AH01889: Init: Failed to enable Crypto Device API `%s'"

./modules/ssl/ssl_engine_init.c:403

AH01890: Init: loaded Crypto Device API `%s'"

./modules/ssl/ssl_engine_init.c:409

AH01891: No SSL Certificate set [hint: SSLCertificateFile]"

./modules/ssl/ssl_engine_init.c:428

AH01892: Illegal attempt to re-initialise SSL for server "(SSLEngine On should go in the VirtualHost, not in global scope.)"

./modules/ssl/ssl_engine_init.c:443

AH01893: Configuring TLS extension handling"

./modules/ssl/ssl_engine_init.c:459

AH01894: Unable to initialize TLS servername extension "callback (incompatible OpenSSL version?)"

./modules/ssl/ssl_engine_init.c:468

AH01895: Unable to configure verify locations "for client authentication"

./modules/ssl/ssl_engine_init.c:684

AH01896: Unable to determine list of acceptable "CA certificates for client authentication"

./modules/ssl/ssl_engine_init.c:700

AH01897: Init: Oops, you want to request client "authentication, but no CAs are known for "verification!? [Hint: SSLCACertificate*]"

./modules/ssl/ssl_engine_init.c:717

AH01898: Unable to configure permitted SSL ciphers"

./modules/ssl/ssl_engine_init.c:745

AH01899: Host %s: CRL checking has been enabled, but "neither %sCARevocationFile nor %sCARevocationPath "is configured", mctx->sc->vhost_id, cfgp, cfgp

./modules/ssl/ssl_engine_init.c:768

AH01900: Configuring certificate revocation facility"

./modules/ssl/ssl_engine_init.c:777

AH01901: Host %s: unable to configure X.509 CRL storage "for certificate revocation", mctx->sc->vhost_id

./modules/ssl/ssl_engine_init.c:782

AH01902: Host %s: X.509 CRL storage locations configured, "but CRL checking (%sCARevocationCheck) is not "enabled", mctx->sc->vhost_id, cfgp

./modules/ssl/ssl_engine_init.c:803

AH01903: Failed to configure CA certificate chain!"

./modules/ssl/ssl_engine_init.c:870

AH01904: Configuring server certificate chain "(%d CA certificate%s)"

./modules/ssl/ssl_engine_init.c:875

AH01905: %s server certificate enables "Server Gated Cryptography (SGC)"

./modules/ssl/ssl_engine_init.c:1034

AH01906: %s server certificate is a CA certificate "(BasicConstraints: CA == TRUE !?)"

./modules/ssl/ssl_engine_init.c:1042

AH01907: %s server certificate is not a leaf certificate "(BasicConstraints: pathlen == %d > 0 !?)"

./modules/ssl/ssl_engine_init.c:1049

AH01908: %sID '%s' in %s certificate configured "for %s matches server name"

./modules/ssl/ssl_engine_init.c:1090

AH01909: %s certificate configured for %s does NOT include "an ID which matches the server name"

./modules/ssl/ssl_engine_init.c:1101

AH01910: Oops, no " KEYTYPES " server certificate found "for '%s:%d'?!", s->server_hostname, s->port

./modules/ssl/ssl_engine_init.c:1142

AH01911: Oops, no " KEYTYPES " server private key found?!"

./modules/ssl/ssl_engine_init.c:1163

AH01913: Unable to initialize TLS session ticket key callback "(incompatible OpenSSL version?)"

./modules/ssl/ssl_engine_init.c:1213

AH01914: Configuring server %s for SSL protocol", sc->vhost_id

./modules/ssl/ssl_engine_init.c:1392

AH01915: Init: (%s) You configured HTTPS(%d) "on the standard HTTP(%d) port!"

./modules/ssl/ssl_engine_init.c:1421

AH01916: Init: (%s) You configured HTTP(%d) "on the standard HTTPS(%d) port!"

./modules/ssl/ssl_engine_init.c:1430

AH01917: Init: You should not use name-based "virtual hosts in conjunction with SSL!!"

./modules/ssl/ssl_engine_init.c:1485

AH01918: no OCSP responder specified in certificate and "no default configured"

./modules/ssl/ssl_engine_ocsp.c:76

AH01919: failed to parse OCSP responder URI '%s'", s

./modules/ssl/ssl_engine_ocsp.c:84

AH01920: cannot handle OCSP responder URI '%s'", s

./modules/ssl/ssl_engine_ocsp.c:90

AH01921: could not retrieve certificate id"

./modules/ssl/ssl_engine_ocsp.c:113

AH01922: OCSP response not successful: %d", rc

./modules/ssl/ssl_engine_ocsp.c:158

AH01923: could not retrieve OCSP basic response"

./modules/ssl/ssl_engine_ocsp.c:167

AH01924: Bad OCSP responder answer (bad nonce)"

./modules/ssl/ssl_engine_ocsp.c:176

AH01925: failed to verify the OCSP response"

./modules/ssl/ssl_engine_ocsp.c:185

AH01926: stapling_get_cert_info: stapling not supported for certificate"

./modules/ssl/ssl_util_stapling.c:170

AH01927: OCSP stapling response encode error??"

./modules/ssl/ssl_util_stapling.c:199

AH01928: OCSP stapling response too big (%u bytes)", resp_derlen

./modules/ssl/ssl_util_stapling.c:205

AH01929: stapling_cache_response: OCSP response session store error!"

./modules/ssl/ssl_util_stapling.c:230

AH01930: stapling_get_cached_response: cache miss"

./modules/ssl/ssl_util_stapling.c:253

AH01931: stapling_get_cached_response: response length invalid??"

./modules/ssl/ssl_util_stapling.c:258

AH01932: stapling_get_cached_response: response parse error??"

./modules/ssl/ssl_util_stapling.c:273

AH01933: stapling_get_cached_response: cache hit"

./modules/ssl/ssl_util_stapling.c:277

AH01934: stapling_check_response: Error Parsing Response!"

./modules/ssl/ssl_util_stapling.c:322

AH01935: stapling_check_response: certificate ID not present in response!"

./modules/ssl/ssl_util_stapling.c:330

AH01936: stapling_check_response: response times invalid"

./modules/ssl/ssl_util_stapling.c:346

AH01937: stapling_check_response: cached response expired"

./modules/ssl/ssl_util_stapling.c:350

AH01938: stapling_renew_response: querying responder"

./modules/ssl/ssl_util_stapling.c:381

AH01939: stapling_renew_response: Error parsing uri %s"

./modules/ssl/ssl_util_stapling.c:411

AH01940: stapling_renew_response: Unsupported uri %s", ocspuri

./modules/ssl/ssl_util_stapling.c:418

AH01941: stapling_renew_response: responder error"

./modules/ssl/ssl_util_stapling.c:434

AH01942: stapling_renew_response: query response received"

./modules/ssl/ssl_util_stapling.c:447

AH01943: stapling_renew_response: error in retreived response!"

./modules/ssl/ssl_util_stapling.c:451

AH01944: stapling_renew_response: responder error %s"

./modules/ssl/ssl_util_stapling.c:456

AH01945: stapling_renew_response: error caching response!"

./modules/ssl/ssl_util_stapling.c:462

AH01946: Cannot reinit %s mutex with file `%s'"

./modules/ssl/ssl_util_stapling.c:514

AH01947: Cannot reinit %s mutex", SSL_STAPLING_MUTEX_TYPE

./modules/ssl/ssl_util_stapling.c:519

AH01948: Failed to acquire OCSP stapling lock"

./modules/ssl/ssl_util_stapling.c:533

AH01949: Failed to release OCSP stapling lock"

./modules/ssl/ssl_util_stapling.c:546

AH01950: stapling_cb: OCSP Stapling disabled"

./modules/ssl/ssl_util_stapling.c:572

AH01951: stapling_cb: OCSP Stapling callback called"

./modules/ssl/ssl_util_stapling.c:577

AH01952: stapling_cb: retrieved cached certificate data"

./modules/ssl/ssl_util_stapling.c:585

AH01953: stapling_cb: retrieved cached response"

./modules/ssl/ssl_util_stapling.c:599

AH01954: stapling_cb: renewing cached response"

./modules/ssl/ssl_util_stapling.c:629

AH01955: stapling_cb: fatal error"

./modules/ssl/ssl_util_stapling.c:635

AH01956: stapling_cb: setting response"

./modules/ssl/ssl_util_stapling.c:643

AH01957: stapling_cb: no response available"

./modules/ssl/ssl_util_stapling.c:649

AH01958: SSLStapling: no stapling cache available"

./modules/ssl/ssl_util_stapling.c:663

AH01959: SSLStapling: cannot initialise stapling mutex"

./modules/ssl/ssl_util_stapling.c:668

AH01960: "OCSP stapling initialized"

./modules/ssl/ssl_util_stapling.c:692

AH01961: SSL Proxy requested for %s but not enabled "[Hint: SSLProxyEngine]", sc->vhost_id

./modules/ssl/mod_ssl.c:365

AH01962: Unable to create a new SSL connection from the SSL "context"

./modules/ssl/mod_ssl.c:429

AH01963: Unable to set session id context to '%s'", vhost_md5

./modules/ssl/mod_ssl.c:445

AH01964: Connection to child %ld established "(server %s)", c->id, sc->vhost_id

./modules/ssl/mod_ssl.c:533

AH01965: Init: Creating pass phrase dialog pipe child "'%s'", sc->server->pphrase_dialog_path

./modules/ssl/ssl_engine_pphrase.c:703

AH01966: Init: Failed to create pass phrase pipe '%s'"

./modules/ssl/ssl_engine_pphrase.c:708

AH01967: Init: Requesting pass phrase via piped dialog"

./modules/ssl/ssl_engine_pphrase.c:716

AH01968: Init: Requesting pass phrase via builtin terminal "dialog"

./modules/ssl/ssl_engine_pphrase.c:733

AH01969: Init: Requesting pass phrase from dialog filter "program (%s)", cmd

./modules/ssl/ssl_engine_pphrase.c:792

AH01970: could not parse OID '%s'", extension

./modules/ssl/ssl_engine_vars.c:906

AH01971: Found an extension '%s', but failed to "create a string from it", extension

./modules/ssl/ssl_engine_vars.c:942

AH01972: could not resolve address of OCSP responder %s"

./modules/ssl/ssl_util_ocsp.c:71

AH01973: connecting to OCSP responder '%s'", uri->hostinfo

./modules/ssl/ssl_util_ocsp.c:78

AH01974: could not connect to OCSP responder '%s'"

./modules/ssl/ssl_util_ocsp.c:96

AH01975: sending request to OCSP responder"

./modules/ssl/ssl_util_ocsp.c:104

AH01976: failed to send request to OCSP responder '%s'"

./modules/ssl/ssl_util_ocsp.c:121

AH01977: failed reading line from OCSP server"

./modules/ssl/ssl_util_ocsp.c:144

AH01978: failed reading line from OCSP server"

./modules/ssl/ssl_util_ocsp.c:151

AH01979: response header line too long from OCSP server"

./modules/ssl/ssl_util_ocsp.c:157

AH01980: bad response from OCSP server: %s"

./modules/ssl/ssl_util_ocsp.c:196

AH01981: OCSP response header: %s", line

./modules/ssl/ssl_util_ocsp.c:208

AH01982: could not read response headers from OCSP server, "exceeded maximum count (%u)", MAX_HEADERS

./modules/ssl/ssl_util_ocsp.c:213

AH01983: could not read response header from OCSP server"

./modules/ssl/ssl_util_ocsp.c:219

AH01984: OCSP response: got EOF"

./modules/ssl/ssl_util_ocsp.c:234

AH01985: error reading response from OCSP server"

./modules/ssl/ssl_util_ocsp.c:239

AH01986: OCSP response size exceeds %u byte limit"

./modules/ssl/ssl_util_ocsp.c:245

AH01987: OCSP response: got %" APR_SIZE_T_FMT bytes, %" APR_SIZE_T_FMT " total", len, count

./modules/ssl/ssl_util_ocsp.c:250

AH01988: failed to decode OCSP response data"

./modules/ssl/ssl_util_ocsp.c:265

AH01989: could not serialize OCSP request"

./modules/ssl/ssl_util_ocsp.c:284

AH01990: %sPRNG still contains insufficient entropy!", prefix

./modules/ssl/ssl_engine_rand.c:127

AH01991: SSL input filter read failed."

./modules/ssl/ssl_engine_io.c:667

AH01992: SSL library error %d reading data", ssl_err

./modules/ssl/ssl_engine_io.c:675

AH01993: SSL output filter write failed."

./modules/ssl/ssl_engine_io.c:779

AH01994: SSL library error %d writing data", ssl_err

./modules/ssl/ssl_engine_io.c:786

AH01995: failed to write %" APR_SSIZE_T_FMT of %" APR_SIZE_T_FMT " bytes (%s)"

./modules/ssl/ssl_engine_io.c:803

AH01996: SSL handshake failed: HTTP spoken on HTTPS port; "trying to send HTML error page"

./modules/ssl/ssl_engine_io.c:855

AH01997: SSL handshake failed: sending 502"

./modules/ssl/ssl_engine_io.c:871

AH01998: ;

./modules/ssl/ssl_engine_io.c:948

AH01999: ;

./modules/ssl/ssl_engine_io.c:957

AH02000: ;

./modules/ssl/ssl_engine_io.c:964

AH02001: ;

./modules/ssl/ssl_engine_io.c:975

AH02002: Failed to set SNI extension for SSL Proxy "request to '%s'", hostname_note

./modules/ssl/ssl_engine_io.c:1072

AH02003: SSL Proxy connect failed"

./modules/ssl/ssl_engine_io.c:1081

AH02004: SSL Proxy: Peer certificate is expired"

./modules/ssl/ssl_engine_io.c:1097

AH02005: SSL Proxy: Peer certificate CN mismatch:" Certificate CN: %s Requested hostname: %s"

./modules/ssl/ssl_engine_io.c:1117

AH02006: SSL handshake stopped: connection was closed"

./modules/ssl/ssl_engine_io.c:1146

AH02007: SSL handshake interrupted by system "[Hint: Stop button pressed in browser?!]"

./modules/ssl/ssl_engine_io.c:1169

AH02008: SSL library error %d in handshake "(server %s)", ssl_err

./modules/ssl/ssl_engine_io.c:1177

AH02009: SSL client authentication failed, "accepting certificate based on "\"SSLVerifyClient optional_no_ca\" "configuration"

./modules/ssl/ssl_engine_io.c:1212

AH02010: SSL client authentication failed: %s"

./modules/ssl/ssl_engine_io.c:1224

AH02011: No acceptable peer certificate available"

./modules/ssl/ssl_engine_io.c:1252

AH02012: unexpected bucket type during coalesce"

./modules/ssl/ssl_engine_io.c:1455

AH02013: coalesce failed to read from data bucket"

./modules/ssl/ssl_engine_io.c:1468

AH02014: unexpected coalesced bucket data length"

./modules/ssl/ssl_engine_io.c:1476

AH02015: could not read request body for SSL buffer"

./modules/ssl/ssl_engine_io.c:1658

AH02016: could not read bucket for SSL buffer"

./modules/ssl/ssl_engine_io.c:1677

AH02017: could not setaside bucket for SSL buffer"

./modules/ssl/ssl_engine_io.c:1686

AH02018: request body exceeds maximum size (%" APR_SIZE_T_FMT) for SSL buffer", maxlen

./modules/ssl/ssl_engine_io.c:1701

AH02019: could not partition buffered SSL brigade"

./modules/ssl/ssl_engine_io.c:1767

AH02020: could not split line from buffered SSL brigade"

./modules/ssl/ssl_engine_io.c:1797

AH02024: Cannot reinit %s mutex with file `%s'"

./modules/ssl/ssl_engine_mutex.c:75

AH02025: Cannot reinit %s mutex", SSL_CACHE_MUTEX_TYPE

./modules/ssl/ssl_engine_mutex.c:79

AH02026: Failed to acquire SSL session cache lock"

./modules/ssl/ssl_engine_mutex.c:92

AH02027: Failed to release SSL session cache lock"

./modules/ssl/ssl_engine_mutex.c:105

AH02028: upgrading connection to TLS"

./modules/ssl/ssl_engine_kernel.c:52

AH02029: failed to send 101 interim response for connection "upgrade"

./modules/ssl/ssl_engine_kernel.c:66

AH02030: TLS upgrade handshake failed: not accepted by client!?"

./modules/ssl/ssl_engine_kernel.c:82

AH02031: Hostname %s provided via SNI, but no hostname" provided in HTTP request", servername

./modules/ssl/ssl_engine_kernel.c:197

AH02032: Hostname %s provided via SNI and hostname %s provided" via HTTP are different", servername, host

./modules/ssl/ssl_engine_kernel.c:207

AH02033: No hostname was provided via SNI for a name based" virtual host"

./modules/ssl/ssl_engine_kernel.c:224

AH02034: %s HTTPS request received for child %ld (server %s)"

./modules/ssl/ssl_engine_kernel.c:236

AH02035: Encountered FakeBasicAuth spoof: %s", username

./modules/ssl/ssl_engine_kernel.c:1005

AH02036: Faking HTTP Basic Auth header: \"Authorization: %s\""

./modules/ssl/ssl_engine_kernel.c:1053

AH02037: Certificate Verification: Verifiable Issuer is "configured as optional, therefore we're accepting "the certificate"

./modules/ssl/ssl_engine_kernel.c:1466

AH02038: cannot perform OCSP validation for cert "if issuer has not been verified "(optional_no_ca configured)"

./modules/ssl/ssl_engine_kernel.c:1502

AH02039: Certificate Verification: Error (%d): %s"

./modules/ssl/ssl_engine_kernel.c:1526

AH02040: Certificate Verification: Certificate Chain too long "(chain has %d certificates, but maximum allowed are "only %d)"

./modules/ssl/ssl_engine_kernel.c:1550

AH02041: Protocol: %s, Cipher: %s (%s/%s bits)"

./modules/ssl/ssl_engine_kernel.c:1894

AH02042: rejecting client initiated renegotiation"

./modules/ssl/ssl_engine_kernel.c:1933

AH02043: SSL virtual host for servername %s found"

./modules/ssl/ssl_engine_kernel.c:1964

AH02044: No matching SSL virtual host for servername "%s found (using default/first virtual host)"

./modules/ssl/ssl_engine_kernel.c:1970

AH02045: Invalid Content-Length header (%s)", cl_header

./modules/apreq/filter.c:130

AH02046: Content-Length header (%s) exceeds configured "max_body limit (%" APR_UINT64_T_FMT ")"

./modules/apreq/filter.c:136

AH02047: removing intermediate apreq filter"

./modules/apreq/filter.c:224

AH02048: relocating intermediate apreq filter"

./modules/apreq/filter.c:231

AH02049: disabling stale protocol filter"

./modules/apreq/filter.c:243

AH02050: prefetching %" APR_OFF_T_FMT " bytes", readbytes

./modules/apreq/filter.c:267

AH02051: ap_get_brigade failed during prefetch"

./modules/apreq/filter.c:274

AH02052: apreq_brigade_concat failed; TempDir problem?"

./modules/apreq/filter.c:286

AH02053: Bytes read (%" APR_UINT64_T_FMT) exceeds configured read limit (%" APR_UINT64_T_FMT ")"

./modules/apreq/filter.c:313

AH02054: Bytes read (%" APR_UINT64_T_FMT) exceeds configured max_body limit (%"

./modules/apreq/filter.c:392

AH02055: Failed to pre-initialize libapreq2"

./modules/apreq/filter.c:413

AH02056: Failed to post-initialize libapreq2"

./modules/apreq/filter.c:428

AH02057: stealing filter context"

./modules/apreq/filter.c:505

AH02058: cannot steal context: bad filter status"

./modules/apreq/filter.c:514

AH02059: Dropping connection from banned IP %s"

./modules/experimental/mod_noloris.c:72

AH02060: noloris: banning %s with %d connections in READ state"

./modules/experimental/mod_noloris.c:151

AH02061: Failed to create shm segment; mod_noloris disabled"

./modules/experimental/mod_noloris.c:171

AH02068: Failed to create listening socket."

./modules/cluster/mod_heartmonitor.c:84

AH02069: Failed to set APR_SO_REUSEADDR to 1 on socket."

./modules/cluster/mod_heartmonitor.c:91

AH02070: Failed to set APR_SO_NONBLOCK to 1 on socket."

./modules/cluster/mod_heartmonitor.c:99

AH02071: Failed to bind on socket."

./modules/cluster/mod_heartmonitor.c:106

AH02072: Failed to join multicast group"

./modules/cluster/mod_heartmonitor.c:114

AH02073: Failed to accept localhost mulitcast on socket."

./modules/cluster/mod_heartmonitor.c:121

AH02074: Unable to open tmp file: %s", path

./modules/cluster/mod_heartmonitor.c:243

AH02075: Unable to read file: %s", ctx->storage_path

./modules/cluster/mod_heartmonitor.c:260

AH02076: Unable to read from file: %s", ctx->storage_path

./modules/cluster/mod_heartmonitor.c:283

AH02077: Unable to flush file: %s", path

./modules/cluster/mod_heartmonitor.c:353

AH02078: Unable to close file: %s", path

./modules/cluster/mod_heartmonitor.c:360

AH02079: Unable to set file permissions on %s"

./modules/cluster/mod_heartmonitor.c:369

AH02080: Unable to move file: %s -> %s", path

./modules/cluster/mod_heartmonitor.c:378

AH02081: Unable to open tmp file: %s", path

./modules/cluster/mod_heartmonitor.c:406

AH02082: Unable to flush file: %s", path

./modules/cluster/mod_heartmonitor.c:432

AH02083: Unable to close file: %s", path

./modules/cluster/mod_heartmonitor.c:439

AH02084: Unable to set file permissions on %s"

./modules/cluster/mod_heartmonitor.c:448

AH02085: Unable to move file: %s -> %s", path

./modules/cluster/mod_heartmonitor.c:457

AH02086: %pI busy=%s ready=%s", from

./modules/cluster/mod_heartmonitor.c:537

AH02087: malformed message from %pI"

./modules/cluster/mod_heartmonitor.c:553

AH02088: "would block"

./modules/cluster/mod_heartmonitor.c:573

AH02089: "recvfrom failed"

./modules/cluster/mod_heartmonitor.c:577

AH02090: Unable to listen for connections!"

./modules/cluster/mod_heartmonitor.c:602

AH02091: %s listener started."

./modules/cluster/mod_heartmonitor.c:607

AH02092: stopping %s listener."

./modules/cluster/mod_heartmonitor.c:649

AH02093: mod_watchdog is required"

./modules/cluster/mod_heartmonitor.c:675

AH02094: Failed to create watchdog instance (%s)"

./modules/cluster/mod_heartmonitor.c:709

AH02095: Failed to register watchdog callback (%s)"

./modules/cluster/mod_heartmonitor.c:720

AH02096: wd callback %s", HM_WATHCHDOG_NAME

./modules/cluster/mod_heartmonitor.c:725

AH02097: "Heartbeat: apr_socket_create failed"

./modules/cluster/mod_heartbeat.c:89

AH02098: "Heartbeat: apr_mcast_loopback failed"

./modules/cluster/mod_heartbeat.c:96

AH02099: "Heartbeat: apr_socket_sendto failed"

./modules/cluster/mod_heartbeat.c:103

AH02100: Failed to open cgi file %s for testing", *cmd

./modules/arch/win32/mod_win32.c:442

AH02101: Failed to read cgi file %s for testing", *cmd

./modules/arch/win32/mod_win32.c:447

AH02102: %s is not executable; ensure interpreted scripts have "\"#!\" or \"'!\" first line", *cmd

./modules/arch/win32/mod_win32.c:508

AH02103: invalid module path, skipping %s", filename

./modules/arch/win32/mod_isapi.c:139

AH02104: unable to stat, skipping %s", fspec

./modules/arch/win32/mod_isapi.c:145

AH02105: not a regular file, skipping %s", fspec

./modules/arch/win32/mod_isapi.c:150

AH02106: unable to cache, skipping %s", fspec

./modules/arch/win32/mod_isapi.c:158

AH02107: failed to load %s", isa->filename

./modules/arch/win32/mod_isapi.c:274

AH02108: missing GetExtensionVersion() in %s"

./modules/arch/win32/mod_isapi.c:284

AH02109: missing HttpExtensionProc() in %s"

./modules/arch/win32/mod_isapi.c:296

AH02110: failed call to GetExtensionVersion() in %s"

./modules/arch/win32/mod_isapi.c:312

AH02111: Could not determine HTTP response code; using %d"

./modules/arch/win32/mod_isapi.c:774

AH02112: Failed to create completion mutex"

./modules/arch/win32/mod_isapi.c:1575

AH02113: %s: %s", r->filename, cid->ecb->lpszLogData

./modules/arch/win32/mod_isapi.c:1586

AH02114: asynch I/O result HSE_STATUS_PENDING "from HttpExtensionProc() is not supported: %s"

./modules/arch/win32/mod_isapi.c:1617

AH02115: HSE_STATUS_ERROR result from "HttpExtensionProc(): %s", r->filename

./modules/arch/win32/mod_isapi.c:1628

AH02116: unrecognized result code %d "from HttpExtensionProc(): %s "

./modules/arch/win32/mod_isapi.c:1635

AH02117: ap_pass_brigade failed to "complete the response: %s ", r->filename

./modules/arch/win32/mod_isapi.c:1657

AH02118: could not create the isapi cache pool"

./modules/arch/win32/mod_isapi.c:1690

AH02119: Failed to create module cache"

./modules/arch/win32/mod_isapi.c:1697

AH02120: make_secure_socket: failed to get a socket for %s"

./modules/arch/netware/mod_nw_ssl.c:261

AH02121: make_secure_socket: for %s, WSAIoctl: "(SO_SSL_SET_FLAGS)", addr

./modules/arch/netware/mod_nw_ssl.c:272

AH02122: make_secure_socket: for %s, WSAIoctl: "(SO_SSL_SET_SERVER)", addr

./modules/arch/netware/mod_nw_ssl.c:287

AH02123: make_secure_socket: for %s, WSAIoctl: "(SO_SSL_SET_FLAGS)", addr

./modules/arch/netware/mod_nw_ssl.c:298

AH02124: Error: %d with ioctlsocket(flag SO_TLS_ENABLE)", WSAGetLastError()

./modules/arch/netware/mod_nw_ssl.c:334

AH02125: Error: %d with ioctl (SO_TLS_SET_CLIENT)", WSAGetLastError()

./modules/arch/netware/mod_nw_ssl.c:369

AH02126: Error: %d with WSAIoctl(SO_TLS_SET_FLAGS, SO_TLS_ENABLE)", WSAGetLastError()

./modules/arch/netware/mod_nw_ssl.c:391

AH02127: Error: %d with WSAIoctl(SO_TLS_SET_FLAGS, SO_TLS_SERVER)", WSAGetLastError()

./modules/arch/netware/mod_nw_ssl.c:402

AH02128: Error: %d with WSAIoctl(SO_TLS_SET_SERVER)", WSAGetLastError()

./modules/arch/netware/mod_nw_ssl.c:440

AH02129: alloc_listener: failed to set up sockaddr for %s:%d", sl->addr, sl->port

./modules/arch/netware/mod_nw_ssl.c:788

AH02130: No Listen directive found for upgradeable listener %s:%d", slu->addr, slu->port

./modules/arch/netware/mod_nw_ssl.c:811

AH02131: Unable to get upgradeable socket handle"

./modules/arch/netware/mod_nw_ssl.c:1170

AH02132: could not send interim 101 Upgrade response"

./modules/arch/netware/mod_nw_ssl.c:1187

AH02133: Upgradeable socket handle not found"

./modules/arch/netware/mod_nw_ssl.c:1205

AH02134: Awaiting re-negotiation handshake"

./modules/arch/netware/mod_nw_ssl.c:1210

AH02135: Could not find a command associated with the %s extension", ext

./modules/arch/netware/mod_netware.c:147

AH02136: PRIV_ON failed restoring default user/group"

./modules/arch/unix/mod_privileges.c:153

AH02137: Error restoring default userid"

./modules/arch/unix/mod_privileges.c:157

AH02138: Error restoring default group"

./modules/arch/unix/mod_privileges.c:161

AH02139: Error restoring default privileges"

./modules/arch/unix/mod_privileges.c:168

AH02140: parent waiting for child"

./modules/arch/unix/mod_privileges.c:219

AH02141: "parent: child %s"

./modules/arch/unix/mod_privileges.c:226

AH02142: "In child!"

./modules/arch/unix/mod_privileges.c:242

AH02143: Failed to fork secure child process!"

./modules/arch/unix/mod_privileges.c:245

AH02144: No privilege to set user/group"

./modules/arch/unix/mod_privileges.c:259

AH02145: Error setting userid"

./modules/arch/unix/mod_privileges.c:266

AH02146: Error setting group"

./modules/arch/unix/mod_privileges.c:271

AH02147: Error setting effective privileges"

./modules/arch/unix/mod_privileges.c:278

AH02148: Error setting inheritable privileges"

./modules/arch/unix/mod_privileges.c:285

AH02149: Error setting limit privileges"

./modules/arch/unix/mod_privileges.c:290

AH02150: Error setting permitted privileges"

./modules/arch/unix/mod_privileges.c:298

AH02151: \Error dropping privileges"); \

./modules/arch/unix/mod_privileges.c:307

AH02152: priv_addset"

./modules/arch/unix/mod_privileges.c:383

AH02153: mod_privileges: unable to determine MPM characteristics." Please ensure you are using a non-threaded MPM "with this module."

./modules/arch/unix/mod_privileges.c:396

AH02154: mod_privileges is not compatible with a threaded MPM."

./modules/arch/unix/mod_privileges.c:402

AH02155: getpwuid: couldn't determine user name from uid %ld, "you probably need to modify the User directive"

./modules/arch/unix/mod_unixd.c:99

AH02156: setgid: unable to set group id to Group %ld"

./modules/arch/unix/mod_unixd.c:118

AH02157: initgroups: unable to set groups for User %s "and Group %ld", name, (long)ap_unixd_config.group_id

./modules/arch/unix/mod_unixd.c:127

AH02158: Cannot chroot when not started as root"

./modules/arch/unix/mod_unixd.c:150

AH02159: Can't chdir to %s", ap_unixd_config.chroot_dir

./modules/arch/unix/mod_unixd.c:157

AH02160: Can't chroot to %s", ap_unixd_config.chroot_dir

./modules/arch/unix/mod_unixd.c:164

AH02161: Can't chdir to new root"

./modules/arch/unix/mod_unixd.c:171

AH02162: setuid: unable to change to uid: %ld"

./modules/arch/unix/mod_unixd.c:184

AH02163: set dumpable failed - this child will not coredump" after software errors"

./modules/arch/unix/mod_unixd.c:194

AH02164: Cannot chroot when not started as root"

./modules/arch/unix/mod_unixd.c:330

AH02165: Can't chdir to %s", ap_unixd_config.chroot_dir

./modules/arch/unix/mod_unixd.c:335

AH02166: Can't chroot to %s", ap_unixd_config.chroot_dir

./modules/arch/unix/mod_unixd.c:340

AH02167: Can't chdir to new root"

./modules/arch/unix/mod_unixd.c:345

AH02168: setuid: unable to change to uid: %ld"

./modules/arch/unix/mod_unixd.c:357

AH02169: set dumpable failed - this child will not coredump" after software errors"

./modules/arch/unix/mod_unixd.c:366

AH02170: The debug mode of Apache should only "be started by an unprivileged user!"

./os/bs2000/os.c:88

AH02171: "ufork: Possible mis-configuration "for user %s - Aborting.", user

./os/bs2000/os.c:118

AH02172: %s: getrlimit failed", cmd->cmd->name

./os/unix/unixd.c:72

AH02173: Invalid parameters for %s", cmd->cmd->name

./os/unix/unixd.c:86

AH02174: Must be uid 0 to raise maximum %s", cmd->cmd->name

./os/unix/unixd.c:99

AH02175: Platform does not support rlimit for %s", cmd->cmd->name

./os/unix/unixd.c:116

AH02176: new file descriptor %d is too large; you probably need "to rebuild Apache with a larger FD_SETSIZE "(currently %d)"

./os/unix/unixd.c:307

AH02177: apr_socket_accept: giving up."

./os/unix/unixd.c:414

AH02178: apr_socket_accept failed for inactive listener"

./os/unix/unixd.c:425

AH02179: apr_socket_accept: (client socket)"

./os/unix/unixd.c:429

AH02180: The debug mode of Apache should only "be started by an unprivileged user!"

./os/unix/unixd.c:496

AH02181: "ufork: Possible mis-configuration "for user %s - Aborting.", user

./os/unix/unixd.c:526

AH02182: macro where the argument

./docs/log-message-tags/README:2

AH02183: "Failed to create subpool for dynamic lock"

./modules/ssl/ssl_util.c:382

AH02185: "Failed to allocate dynamic lock structure"

./modules/ssl/ssl_util.c:393

AH02186: Failed to create thread mutex for dynamic lock"

./modules/ssl/ssl_util.c:405

AH02192: "Failed to destroy mutex for dynamic "lock %s:%d", l->file, l->line

./modules/ssl/ssl_util.c:451

AH02193: "xlate filter - a built-in restriction was encountered";

./modules/filters/mod_charset_lite.c:482

AH02194: "xlate filter - an input character was invalid";

./modules/filters/mod_charset_lite.c:486

AH02195: "xlate filter - bucket read routine failed";

./modules/filters/mod_charset_lite.c:490

AH02196: "xlate filter - incomplete char at end of input - "

./modules/filters/mod_charset_lite.c:494

AH02197: "xlate filter - an error occurred in a lower filter";

./modules/filters/mod_charset_lite.c:504

AH02198: "xlate filter - returning error";

./modules/filters/mod_charset_lite.c:507

AH02199: SSL not enabled on vhost %s, skipping SSL setup"

./modules/ssl/ssl_engine_pphrase.c:179

AH02200: Loading certificate & private key of SSL-aware server '%s'"

./modules/ssl/ssl_engine_pphrase.c:185

AH02201: Init: Can't open server certificate file %s"

./modules/ssl/ssl_engine_pphrase.c:225

AH02202: Init: Read server certificate from '%s'"

./modules/ssl/ssl_engine_pphrase.c:237

AH02203: "Init: Private key not found"

./modules/ssl/ssl_engine_pphrase.c:448

AH02204: Init: Pass phrase incorrect for key of %s"

./modules/ssl/ssl_engine_pphrase.c:457

AH02205: Init: Wiped out the queried pass phrases from memory"

./modules/ssl/ssl_engine_pphrase.c:571

AH02206: no client certs found for SSL proxy"

./modules/ssl/ssl_engine_init.c:1257

AH02207: loaded %d client certs for SSL proxy"

./modules/ssl/ssl_engine_init.c:1277

AH02208: SSL proxy client cert initialization failed"

./modules/ssl/ssl_engine_init.c:1292

AH02209: CA certificate: %s"

./modules/ssl/ssl_engine_init.c:1520

AH02210: Failed to load SSLCACertificateFile: %s", ca_file

./modules/ssl/ssl_engine_init.c:1566

AH02211: Failed to open Certificate Path `%s'"

./modules/ssl/ssl_engine_init.c:1582

AH02212: "Can't open %s", pkcs7

./modules/ssl/ssl_util.c:289

AH02213: Don't understand PKCS7 file %s", pkcs7

./modules/ssl/ssl_util.c:315

AH02214: No certificates in %s", pkcs7

./modules/ssl/ssl_util.c:321

AH02215: ssl_stapling_init_cert: certificate already initialized!"

./modules/ssl/ssl_util_stapling.c:119

AH02216: ssl_stapling_init_cert: error allocating memory!"

./modules/ssl/ssl_util_stapling.c:125

AH02217: ssl_stapling_init_cert: Can't retrieve issuer certificate!"

./modules/ssl/ssl_util_stapling.c:136

AH02218: ssl_stapling_init_cert: no responder URL"

./modules/ssl/ssl_util_stapling.c:151

AH02219: access to %s failed, reason: %s"

./modules/ssl/ssl_engine_kernel.c:334

AH02220: Reconfigured cipher suite will force renegotiation"

./modules/ssl/ssl_engine_kernel.c:486

AH02221: Requesting connection re-negotiation"

./modules/ssl/ssl_engine_kernel.c:677

AH02222: Cannot find peer certificate chain"

./modules/ssl/ssl_engine_kernel.c:703

AH02223: Cannot find certificate storage"

./modules/ssl/ssl_engine_kernel.c:712

AH02224: Re-negotiation verification step failed"

./modules/ssl/ssl_engine_kernel.c:734

AH02225: Re-negotiation request failed"

./modules/ssl/ssl_engine_kernel.c:792

AH02226: Awaiting re-negotiation handshake"

./modules/ssl/ssl_engine_kernel.c:800

AH02227: Failed to set r->user to '%s'", dc->szUserName

./modules/ssl/ssl_engine_kernel.c:895

AH02228: Failed expression: %s", req->cpExpr

./modules/ssl/ssl_engine_kernel.c:928

AH02229: access to %s failed, reason: %s"

./modules/ssl/ssl_engine_kernel.c:931

AH02230: mod_proxy must be loaded for mod_proxy_balancer"

./modules/proxy/mod_proxy_balancer.c:710

AH02231: No SSL protocols available [hint: SSLProtocol]"

./modules/ssl/ssl_engine_init.c:501

AH02232: Configuring %s server certificate", type

./modules/ssl/ssl_engine_init.c:922

AH02233: Unable to import %s server certificate", type

./modules/ssl/ssl_engine_init.c:927

AH02234: Unable to configure %s server certificate", type

./modules/ssl/ssl_engine_init.c:934

AH02235: Unable to configure server certificate for stapling"

./modules/ssl/ssl_engine_init.c:943

AH02236: Configuring %s server private key", type

./modules/ssl/ssl_engine_init.c:977

AH02237: Unable to import %s server private key", type

./modules/ssl/ssl_engine_init.c:983

AH02238: Unable to configure %s server private key", type

./modules/ssl/ssl_engine_init.c:990

AH02239: Copying DSA parameters from private key to certificate"

./modules/ssl/ssl_engine_init.c:1005

AH02240: Server should be SSL-aware but has no certificate "configured [Hint: SSLCertificateFile] (%s:%d)"

./modules/ssl/ssl_engine_pphrase.c:195

AH02241: Init: Unable to read server certificate from" file %s", szPath

./modules/ssl/ssl_engine_pphrase.c:231

AH02242: Init: Multiple %s server certificates not "allowed", an

./modules/ssl/ssl_engine_pphrase.c:248

AH02243: Init: Can't open server private key file "%s",szPath

./modules/ssl/ssl_engine_pphrase.c:328

AH02244: %s reusing existing "%s private key on restart"

./modules/ssl/ssl_engine_pphrase.c:360

AH02245: Init: SSLPassPhraseDialog builtin is not "supported on Win32 (key file "%s)", szPath

./modules/ssl/ssl_engine_pphrase.c:424

AH02246: Init: Unable to read pass phrase "[Hint: key introduced or changed "before restart?]"

./modules/ssl/ssl_engine_pphrase.c:440

AH02247: Init: Unable to read server private key from "file %s [Hint: Perhaps it is in a separate file? " See SSLCertificateKeyFile]", szPath

./modules/ssl/ssl_engine_pphrase.c:477

AH02248: Init: Multiple %s server private keys not "allowed", an

./modules/ssl/ssl_engine_pphrase.c:492

AH02249: unencrypted %s private key - pass phrase not "required", an

./modules/ssl/ssl_engine_pphrase.c:504

AH02250: encrypted %s private key - pass phrase "requested", an

./modules/ssl/ssl_engine_pphrase.c:511

AH02251: encrypted %s private key - pass phrase" reused", an

./modules/ssl/ssl_engine_pphrase.c:517

AH02252: incomplete client cert configured for SSL proxy "(missing or encrypted private key?)"

./modules/ssl/ssl_engine_init.c:1269

AH02253: Unable to reconfigure (per-directory) "permitted SSL ciphers"

./modules/ssl/ssl_engine_kernel.c:414

AH02254: Reduced client verification depth will force "renegotiation"

./modules/ssl/ssl_engine_kernel.c:511

AH02255: Changed client verification type will force "%srenegotiation"

./modules/ssl/ssl_engine_kernel.c:575

AH02256: Non-default virtual host with SSLVerify set to "'require' and VirtualHost-specific CA certificate "list is only available to clients with TLS server "name indication (SNI) support"

./modules/ssl/ssl_engine_kernel.c:605

AH02257: could not buffer message body to allow "SSL renegotiation to proceed"

./modules/ssl/ssl_engine_kernel.c:655

AH02258: Performing quick renegotiation: "just re-verifying the peer"

./modules/ssl/ssl_engine_kernel.c:684

AH02259: insecure SSL re-negotiation required, but "a pipelined request is present; keepalive "disabled"

./modules/ssl/ssl_engine_kernel.c:761

AH02260: Performing full renegotiation: complete handshake "protocol (%s support secure renegotiation)"

./modules/ssl/ssl_engine_kernel.c:775

AH02261: Re-negotiation handshake failed: "Not accepted by client!?"

./modules/ssl/ssl_engine_kernel.c:817

AH02262: Re-negotiation handshake failed: "Client verification failed"

./modules/ssl/ssl_engine_kernel.c:846

AH02263: Re-negotiation handshake failed: "Client certificate missing"

./modules/ssl/ssl_engine_kernel.c:855

AH02264: SSL cipher suite not renegotiated: "access to %s denied using cipher %s"

./modules/ssl/ssl_engine_kernel.c:872

AH02265: access to %s failed, reason: Failed to execute "SSL requirement expression: %s"

./modules/ssl/ssl_engine_kernel.c:911

AH02266: Access to %s denied for %s "(requirement expression not fulfilled)"

./modules/ssl/ssl_engine_kernel.c:923

AH02267:

./modules/ssl/ssl_engine_kernel.c:1605

AH02268:

./modules/ssl/ssl_engine_kernel.c:1610

AH02269:

./modules/ssl/ssl_engine_kernel.c:1674

AH02270: "SSL proxy client cert chain "verification failed: %s :"

./modules/ssl/ssl_engine_init.c:1310

AH02271: loaded %i intermediate CA%s for cert %i: "

./modules/ssl/ssl_engine_init.c:1336

AH02272: failed to retrieve OCSP response status"

./modules/ssl/ssl_engine_ocsp.c:199

AH02273: OCSP response outside validity period"

./modules/ssl/ssl_engine_ocsp.c:219

AH02274: Can't read PKCS7 object %s", pkcs7

./modules/ssl/ssl_util.c:295

AH02275: Certificate Verification, depth %d, "CRL checking mode: %s", errdepth

./modules/ssl/ssl_engine_kernel.c:1437

AH02276: Certificate Verification: Error (%d): %s"

./modules/ssl/ssl_engine_kernel.c:1522

AH02277:

./modules/ssl/ssl_engine_kernel.c:1575

AH02278: "no acceptable CA list"

./modules/ssl/ssl_engine_kernel.c:1626

AH02279: found acceptable cert"

./modules/ssl/ssl_engine_kernel.c:1643

AH02280: found acceptable cert by intermediate CA"

./modules/ssl/ssl_engine_kernel.c:1662

AH02281: Failed to lookup provider 'shm' for '%s'. Maybe you "need to load mod_slotmem_shm?"

./modules/proxy/balancers/mod_lbmethod_heartbeat.c:377

AH02282: No slotmem from mod_heartmonitor"

./modules/proxy/balancers/mod_lbmethod_heartbeat.c:387

AH02283: Using slotmem from mod_heartmonitor"

./modules/proxy/balancers/mod_lbmethod_heartbeat.c:390

AH02284: failed to lookup provider 'shm' for '%s', "maybe you need to load mod_slotmem_shm?"

./modules/cluster/mod_heartmonitor.c:687

AH02285: slotmem_create for status failed"

./modules/cluster/mod_heartmonitor.c:695

AH02286: Failed to open ticket key file %s: (%d) %pm"

./modules/ssl/ssl_engine_init.c:1192

AH02287: Failed to read %d bytes from %s: (%d) %pm"

./modules/ssl/ssl_engine_init.c:1201

AH02288: TLS session ticket key for %s successfully loaded from %s"

./modules/ssl/ssl_engine_init.c:1220

AH02289: TLS session ticket key for %s successfully set, "creating new session ticket", sc->vhost_id

./modules/ssl/ssl_engine_kernel.c:2139

AH02290: TLS session ticket key for %s successfully set, "decrypting existing session ticket", sc->vhost_id

./modules/ssl/ssl_engine_kernel.c:2160

AH02291: Cannot access directory '%s' for %s", dir, desc

./server/core.c:4381

AH02292: Init: Name-based SSL virtual hosts only "work for clients with TLS server name indication "support (RFC 4366)"

./modules/ssl/ssl_engine_init.c:1489

AH02293: slotmem(%s) grab failed. Num %u/num_free %u"

./modules/slotmem/mod_slotmem_shm.c:575

AH02294: slotmem(%s) release failed. Num %u/inuse[%u] %d"

./modules/slotmem/mod_slotmem_shm.c:599

AH02295: %s in .htaccess forbidden by AllowOverride"

./server/config.c:854

AH02296: "Unknown directive %s "perhaps misspelled or defined by a module "not included in the server configuration", dir

./server/config.c:1267

AH02297: Cannot access directory '%s' for log file '%s' "defined at %s:%d", dir, cls->fname

./modules/loggers/mod_log_config.c:1700

ListOfErrors (last edited 2012-03-09 15:03:43 by b72093)