Cocoon 2.1.9 starts and seems to work normally on Harmony (IBM VME + Classlib).

Known issues:

I have run the htmlunit tests on RI, Harmony Classlib + DRLVM and Harmony Classlib + IBM VME. One test (org.apache.cocoon.CachingPipelineTestCase) hangs on all implementations, so it was excluded. 48 tests have been run. The results are:

3 test failures on RI:

9 failures on Harmony classlib + IBM VME:

24 failures on Harmony classlib + DRLVM:

"java.lang.RuntimeException: unexpected java.lang.ClassNotFoundException: inv8" where 8 changes to another integer values in different failures. And some look like: org.apache.cocoon.ProcessingException: Sitemap: error calling function 'do_a'.

Apache_Cocoon (last edited 2009-09-20 21:54:23 by localhost)